Comment 30 for bug 971876

hawezet@t-online.de (hawezet) wrote :

Hello,well in my PC doesnt work the sd-card.
Have tryed : wget http://planet76.com/drivers/realtek/rts-bpp-dkms_1.1_all.deb
sudo apt-get install dkms
sudo dpkg -i rts-bpp-dkms_1.1_all.deb
the answer:DKMS: ldtarball completed.

Creating symlink /var/lib/dkms/rts_bpp/1.1/source ->
                 /usr/src/rts_bpp-1.1

DKMS: add completed.
First Installation: checking all kernels...
Building only for 3.8.0-19-generic
Building for architecture x86_64
Building initial module for 3.8.0-19-generic
Traceback (most recent call last):
  File "/usr/share/apport/package-hooks/dkms_packages.py", line 22, in <module>
    import apport
ImportError: No module named apport
Error! Bad return status for module build on kernel: 3.8.0-19-generic (x86_64)
Consult /var/lib/dkms/rts_bpp/1.1/build/make.log for more information.
here the make.log:DKMS make.log for rts_bpp-1.1 for kernel 3.8.0-19-generic (x86_64)
Sa 27. Apr 07:44:46 CEST 2013
make: Gehe in Verzeichnis '/usr/src/linux-headers-3.8.0-19-generic'
  CC [M] /var/lib/dkms/rts_bpp/1.1/build/src/rtsx.o
/var/lib/dkms/rts_bpp/1.1/build/src/rtsx.c:893:22: Fehler: expected »=«, »,«, »;«, »asm« or »__attribute__« before »rtsx_probe«
/var/lib/dkms/rts_bpp/1.1/build/src/rtsx.c:1048:23: Fehler: expected »=«, »,«, »;«, »asm« or »__attribute__« before »rtsx_remove«
/var/lib/dkms/rts_bpp/1.1/build/src/rtsx.c:1073:11: Fehler: »rtsx_probe« ist hier nicht deklariert (nicht in einer Funktion)
/var/lib/dkms/rts_bpp/1.1/build/src/rtsx.c:1074:2: Fehler: Implizite Deklaration der Funktion »__devexit_p« [-Werror=implicit-function-declaration]
/var/lib/dkms/rts_bpp/1.1/build/src/rtsx.c:1074:24: Fehler: »rtsx_remove« ist hier nicht deklariert (nicht in einer Funktion)
/var/lib/dkms/rts_bpp/1.1/build/src/rtsx.c:255:34: Warnung: »rtsx_host_template« definiert, aber nicht verwendet [-Wunused-variable]
/var/lib/dkms/rts_bpp/1.1/build/src/rtsx.c:450:12: Warnung: »rtsx_control_thread« definiert, aber nicht verwendet [-Wunused-function]
/var/lib/dkms/rts_bpp/1.1/build/src/rtsx.c:559:12: Warnung: »rtsx_polling_thread« definiert, aber nicht verwendet [-Wunused-function]
/var/lib/dkms/rts_bpp/1.1/build/src/rtsx.c:715:13: Warnung: »quiesce_and_remove_host« definiert, aber nicht verwendet [-Wunused-function]
/var/lib/dkms/rts_bpp/1.1/build/src/rtsx.c:751:13: Warnung: »release_everything« definiert, aber nicht verwendet [-Wunused-function]
/var/lib/dkms/rts_bpp/1.1/build/src/rtsx.c:761:12: Warnung: »rtsx_scan_thread« definiert, aber nicht verwendet [-Wunused-function]
/var/lib/dkms/rts_bpp/1.1/build/src/rtsx.c:786:13: Warnung: »rtsx_init_options« definiert, aber nicht verwendet [-Wunused-function]
cc1: Einige Warnungen werden als Fehler behandelt
make[1]: *** [/var/lib/dkms/rts_bpp/1.1/build/src/rtsx.o] Fehler 1
make: *** [rts_bpp.ko] Fehler 2
make: Verlasse Verzeichnis '/usr/src/linux-headers-3.8.0-19-generic'
...
can you help ???
thanks
Hans-Werner