Ubuntu

Comment 565 for bug 550625

Vladimir Hidalgo (vlad88sv) wrote :

Can't compile 0.10 into kernel 3.2 (from kernel mainline ppa)

$ cat /var/lib/dkms/psmouse-alps/0.10/build/make.log

DKMS make.log for psmouse-alps-0.10 for kernel 3.2.0-999-generic (i686)
vie nov 18 20:00:36 CST 2011
make: se ingresa al directorio «/usr/src/linux-headers-3.2.0-999-generic»
  LD /var/lib/dkms/psmouse-alps/0.10/build/src/built-in.o
  CC [M] /var/lib/dkms/psmouse-alps/0.10/build/src/psmouse-base.o
  CC [M] /var/lib/dkms/psmouse-alps/0.10/build/src/synaptics.o
  CC [M] /var/lib/dkms/psmouse-alps/0.10/build/src/alps.o
/var/lib/dkms/psmouse-alps/0.10/build/src/alps.c:135:33: error: expected ‘)’ before ‘int’
make[2]: *** [/var/lib/dkms/psmouse-alps/0.10/build/src/alps.o] Error 1
make[1]: *** [/var/lib/dkms/psmouse-alps/0.10/build/src] Error 2
make: *** [_module_/var/lib/dkms/psmouse-alps/0.10/build] Error 2
make: se sale del directorio «/usr/src/linux-headers-3.2.0-999-generic»