Ubuntu

Compilation errors on compat_xtables.c

Reported by Mark Honman on 2012-04-08
6
This bug affects 1 person
Affects Status Importance Assigned to Milestone
xtables-addons (Ubuntu)
Undecided
Unassigned

Bug Description

When using module-assistant to build the package (module-assistant auto-install xtables-addons-source) the following log file is generated (as ever with such things the interesting stuff is about towards the end,

/usr/src/modules/xtables-addons/compat_xtables.c:453:2: error: implicit declaration of function âtry_then_request_moduleâ [-Werror=implicit-function-declaration]
  and
/usr/src/modules/xtables-addons/compat_xtables.c:618:16: error: expected declaration specifiers or â...â before string constant
)

now the log file:

Updated infos about 1 packages
Getting source for kernel version: 3.2.0-22-generic
Kernel headers available in /usr/src/linux
Creating symlink...
Couldn't create the /usr/src/linux symlink!
apt-get install build-essential
Reading package lists... Done
Building dependency tree
Reading state information... Done
build-essential is already the newest version.
0 upgraded, 0 newly installed, 0 to remove and 0 not upgraded.

Done!
unpack
Extracting the package tarball, /usr/src/xtables-addons.tar.bz2, please wait...
"/usr/share/modass/packages/default.sh" build KVERS=3.2.0-22-generic KSRC=/usr/src/linux-headers-3.2.0-22-generic KDREV=3.2.0-22.35 kdist_image
root@databank:/home/wits# /var/cache/modass/xtables-addons-source*buildlog*
bash: /var/cache/modass/xtables-addons-source.buildlog.3.2.0-22-generic.1333921175: Permission denied
root@databank:/home/wits# cat /var/cache/modass/xtables-addons-source*buildlog*
/usr/bin/make -C /usr/src/linux M=/usr/src/modules/xtables-addons XA_ABSTOPSRCDIR=/usr/src/modules/xtables-addons XA_TOPSRCDIR=/usr/src/modules/xtables-addons DEPMOD=/bin/true clean
make[1]: Entering directory `/usr/src/linux-headers-3.2.0-22-generic'
make[1]: Leaving directory `/usr/src/linux-headers-3.2.0-22-generic'
dh_auto_clean
dh_prep
dh_clean
/usr/bin/make -f debian/rules kdist_clean kdist_config binary-modules
make[1]: Entering directory `/usr/src/modules/xtables-addons'
/usr/bin/make -C /usr/src/linux M=/usr/src/modules/xtables-addons XA_ABSTOPSRCDIR=/usr/src/modules/xtables-addons XA_TOPSRCDIR=/usr/src/modules/xtables-addons DEPMOD=/bin/true clean
make[2]: Entering directory `/usr/src/linux-headers-3.2.0-22-generic'
make[2]: Leaving directory `/usr/src/linux-headers-3.2.0-22-generic'
dh_auto_clean
dh_prep
dh_clean
for templ in ; do \
    cp $templ `echo $templ | sed -e 's/_KVERS_/3.2.0-22-generic/g'` ; \
  done
for templ in `ls debian/*.modules.in` ; do \
    test -e ${templ%.modules.in}.backup || cp ${templ%.modules.in} ${templ%.modules.in}.backup 2>/dev/null || true; \
    sed -e 's/##KVERS##/3.2.0-22-generic/g ;s/#KVERS#/3.2.0-22-generic/g ; s/_KVERS_/3.2.0-22-generic/g ; s/##KDREV##/3.2.0-22.35/g ; s/#KDREV#/3.2.0-22.35/g ; s/_KDREV_/3.2.0-22.35/g ' < $templ > ${templ%.modules.in}; \
  done
dh binary-arch
   dh_testdir -a
   dh_auto_configure -a
   debian/rules override_dh_auto_build
make[2]: Entering directory `/usr/src/modules/xtables-addons'
dh_auto_build -- -C /usr/src/linux M=/usr/src/modules/xtables-addons XA_ABSTOPSRCDIR=/usr/src/modules/xtables-addons XA_TOPSRCDIR=/usr/src/modules/xtables-addons DEPMOD=/bin/true
make[3]: Entering directory `/usr/src/linux-headers-3.2.0-22-generic'
  LD /usr/src/modules/xtables-addons/built-in.o
  CC [M] /usr/src/modules/xtables-addons/compat_xtables.o
/usr/src/modules/xtables-addons/compat_xtables.c:403:1: warning: data definition has no type or storage class [enabled by default]
/usr/src/modules/xtables-addons/compat_xtables.c:403:1: warning: type defaults to âintâ in declaration of âEXPORT_SYMBOL_GPLâ [-Wimplicit-int]
/usr/src/modules/xtables-addons/compat_xtables.c:403:1: warning: parameter names (without types) in function declaration [enabled by default]
/usr/src/modules/xtables-addons/compat_xtables.c:420:1: warning: data definition has no type or storage class [enabled by default]
/usr/src/modules/xtables-addons/compat_xtables.c:420:1: warning: type defaults to âintâ in declaration of âEXPORT_SYMBOL_GPLâ [-Wimplicit-int]
/usr/src/modules/xtables-addons/compat_xtables.c:420:1: warning: parameter names (without types) in function declaration [enabled by default]
/usr/src/modules/xtables-addons/compat_xtables.c:427:1: warning: data definition has no type or storage class [enabled by default]
/usr/src/modules/xtables-addons/compat_xtables.c:427:1: warning: type defaults to âintâ in declaration of âEXPORT_SYMBOL_GPLâ [-Wimplicit-int]
/usr/src/modules/xtables-addons/compat_xtables.c:427:1: warning: parameter names (without types) in function declaration [enabled by default]
/usr/src/modules/xtables-addons/compat_xtables.c:436:1: warning: data definition has no type or storage class [enabled by default]
/usr/src/modules/xtables-addons/compat_xtables.c:436:1: warning: type defaults to âintâ in declaration of âEXPORT_SYMBOL_GPLâ [-Wimplicit-int]
/usr/src/modules/xtables-addons/compat_xtables.c:436:1: warning: parameter names (without types) in function declaration [enabled by default]
/usr/src/modules/xtables-addons/compat_xtables.c: In function âxtnu_request_find_matchâ:
/usr/src/modules/xtables-addons/compat_xtables.c:453:2: error: implicit declaration of function âtry_then_request_moduleâ [-Werror=implicit-function-declaration]
/usr/src/modules/xtables-addons/compat_xtables.c:453:8: warning: assignment makes pointer from integer without a cast [enabled by default]
/usr/src/modules/xtables-addons/compat_xtables.c: At top level:
/usr/src/modules/xtables-addons/compat_xtables.c:460:1: warning: data definition has no type or storage class [enabled by default]
/usr/src/modules/xtables-addons/compat_xtables.c:460:1: warning: type defaults to âintâ in declaration of âEXPORT_SYMBOL_GPLâ [-Wimplicit-int]
/usr/src/modules/xtables-addons/compat_xtables.c:460:1: warning: parameter names (without types) in function declaration [enabled by default]
/usr/src/modules/xtables-addons/compat_xtables.c:473:1: warning: data definition has no type or storage class [enabled by default]
/usr/src/modules/xtables-addons/compat_xtables.c:473:1: warning: type defaults to âintâ in declaration of âEXPORT_SYMBOL_GPLâ [-Wimplicit-int]
/usr/src/modules/xtables-addons/compat_xtables.c:473:1: warning: parameter names (without types) in function declaration [enabled by default]
/usr/src/modules/xtables-addons/compat_xtables.c:483:1: warning: data definition has no type or storage class [enabled by default]
/usr/src/modules/xtables-addons/compat_xtables.c:483:1: warning: type defaults to âintâ in declaration of âEXPORT_SYMBOL_GPLâ [-Wimplicit-int]
/usr/src/modules/xtables-addons/compat_xtables.c:483:1: warning: parameter names (without types) in function declaration [enabled by default]
/usr/src/modules/xtables-addons/compat_xtables.c:616:1: warning: data definition has no type or storage class [enabled by default]
/usr/src/modules/xtables-addons/compat_xtables.c:616:1: warning: type defaults to âintâ in declaration of âEXPORT_SYMBOL_GPLâ [-Wimplicit-int]
/usr/src/modules/xtables-addons/compat_xtables.c:616:1: warning: parameter names (without types) in function declaration [enabled by default]
/usr/src/modules/xtables-addons/compat_xtables.c:618:16: error: expected declaration specifiers or â...â before string constant
cc1: some warnings being treated as errors
make[4]: *** [/usr/src/modules/xtables-addons/compat_xtables.o] Error 1
make[3]: *** [_module_/usr/src/modules/xtables-addons] Error 2
make[3]: Leaving directory `/usr/src/linux-headers-3.2.0-22-generic'
dh_auto_build: make -j1 -C /usr/src/linux M=/usr/src/modules/xtables-addons XA_ABSTOPSRCDIR=/usr/src/modules/xtables-addons XA_TOPSRCDIR=/usr/src/modules/xtables-addons DEPMOD=/bin/true returned exit code 2
make[2]: *** [override_dh_auto_build] Error 2
make[2]: Leaving directory `/usr/src/modules/xtables-addons'
make[1]: *** [binary-modules] Error 2
make[1]: Leaving directory `/usr/src/modules/xtables-addons'
make: *** [kdist_build] Error 2
/usr/bin/make -C /usr/src/linux-headers-3.2.0-22-generic M=/usr/src/modules/xtables-addons XA_ABSTOPSRCDIR=/usr/src/modules/xtables-addons XA_TOPSRCDIR=/usr/src/modules/xtables-addons DEPMOD=/bin/true clean
make[1]: Entering directory `/usr/src/linux-headers-3.2.0-22-generic'
  CLEAN /usr/src/modules/xtables-addons/.tmp_versions
make[1]: Leaving directory `/usr/src/linux-headers-3.2.0-22-generic'
dh_auto_clean
dh_prep
dh_clean
/usr/bin/make -f debian/rules kdist_clean kdist_config binary-modules
make[1]: Entering directory `/usr/src/modules/xtables-addons'
/usr/bin/make -C /usr/src/linux-headers-3.2.0-22-generic M=/usr/src/modules/xtables-addons XA_ABSTOPSRCDIR=/usr/src/modules/xtables-addons XA_TOPSRCDIR=/usr/src/modules/xtables-addons DEPMOD=/bin/true clean
make[2]: Entering directory `/usr/src/linux-headers-3.2.0-22-generic'
make[2]: Leaving directory `/usr/src/linux-headers-3.2.0-22-generic'
dh_auto_clean
dh_prep
dh_clean
for templ in ; do \
    cp $templ `echo $templ | sed -e 's/_KVERS_/3.2.0-22-generic/g'` ; \
  done
for templ in `ls debian/*.modules.in` ; do \
    test -e ${templ%.modules.in}.backup || cp ${templ%.modules.in} ${templ%.modules.in}.backup 2>/dev/null || true; \
    sed -e 's/##KVERS##/3.2.0-22-generic/g ;s/#KVERS#/3.2.0-22-generic/g ; s/_KVERS_/3.2.0-22-generic/g ; s/##KDREV##/3.2.0-22.35/g ; s/#KDREV#/3.2.0-22.35/g ; s/_KDREV_/3.2.0-22.35/g ' < $templ > ${templ%.modules.in}; \
  done
dh binary-arch
   dh_testdir -a
   dh_auto_configure -a
   debian/rules override_dh_auto_build
make[2]: Entering directory `/usr/src/modules/xtables-addons'
dh_auto_build -- -C /usr/src/linux-headers-3.2.0-22-generic M=/usr/src/modules/xtables-addons XA_ABSTOPSRCDIR=/usr/src/modules/xtables-addons XA_TOPSRCDIR=/usr/src/modules/xtables-addons DEPMOD=/bin/true
make[3]: Entering directory `/usr/src/linux-headers-3.2.0-22-generic'
  LD /usr/src/modules/xtables-addons/built-in.o
  CC [M] /usr/src/modules/xtables-addons/compat_xtables.o
/usr/src/modules/xtables-addons/compat_xtables.c:403:1: warning: data definition has no type or storage class [enabled by default]
/usr/src/modules/xtables-addons/compat_xtables.c:403:1: warning: type defaults to âintâ in declaration of âEXPORT_SYMBOL_GPLâ [-Wimplicit-int]
/usr/src/modules/xtables-addons/compat_xtables.c:403:1: warning: parameter names (without types) in function declaration [enabled by default]
/usr/src/modules/xtables-addons/compat_xtables.c:420:1: warning: data definition has no type or storage class [enabled by default]
/usr/src/modules/xtables-addons/compat_xtables.c:420:1: warning: type defaults to âintâ in declaration of âEXPORT_SYMBOL_GPLâ [-Wimplicit-int]
/usr/src/modules/xtables-addons/compat_xtables.c:420:1: warning: parameter names (without types) in function declaration [enabled by default]
/usr/src/modules/xtables-addons/compat_xtables.c:427:1: warning: data definition has no type or storage class [enabled by default]
/usr/src/modules/xtables-addons/compat_xtables.c:427:1: warning: type defaults to âintâ in declaration of âEXPORT_SYMBOL_GPLâ [-Wimplicit-int]
/usr/src/modules/xtables-addons/compat_xtables.c:427:1: warning: parameter names (without types) in function declaration [enabled by default]
/usr/src/modules/xtables-addons/compat_xtables.c:436:1: warning: data definition has no type or storage class [enabled by default]
/usr/src/modules/xtables-addons/compat_xtables.c:436:1: warning: type defaults to âintâ in declaration of âEXPORT_SYMBOL_GPLâ [-Wimplicit-int]
/usr/src/modules/xtables-addons/compat_xtables.c:436:1: warning: parameter names (without types) in function declaration [enabled by default]
/usr/src/modules/xtables-addons/compat_xtables.c: In function âxtnu_request_find_matchâ:
/usr/src/modules/xtables-addons/compat_xtables.c:453:2: error: implicit declaration of function âtry_then_request_moduleâ [-Werror=implicit-function-declaration]
/usr/src/modules/xtables-addons/compat_xtables.c:453:8: warning: assignment makes pointer from integer without a cast [enabled by default]
/usr/src/modules/xtables-addons/compat_xtables.c: At top level:
/usr/src/modules/xtables-addons/compat_xtables.c:460:1: warning: data definition has no type or storage class [enabled by default]
/usr/src/modules/xtables-addons/compat_xtables.c:460:1: warning: type defaults to âintâ in declaration of âEXPORT_SYMBOL_GPLâ [-Wimplicit-int]
/usr/src/modules/xtables-addons/compat_xtables.c:460:1: warning: parameter names (without types) in function declaration [enabled by default]
/usr/src/modules/xtables-addons/compat_xtables.c:473:1: warning: data definition has no type or storage class [enabled by default]
/usr/src/modules/xtables-addons/compat_xtables.c:473:1: warning: type defaults to âintâ in declaration of âEXPORT_SYMBOL_GPLâ [-Wimplicit-int]
/usr/src/modules/xtables-addons/compat_xtables.c:473:1: warning: parameter names (without types) in function declaration [enabled by default]
/usr/src/modules/xtables-addons/compat_xtables.c:483:1: warning: data definition has no type or storage class [enabled by default]
/usr/src/modules/xtables-addons/compat_xtables.c:483:1: warning: type defaults to âintâ in declaration of âEXPORT_SYMBOL_GPLâ [-Wimplicit-int]
/usr/src/modules/xtables-addons/compat_xtables.c:483:1: warning: parameter names (without types) in function declaration [enabled by default]
/usr/src/modules/xtables-addons/compat_xtables.c:616:1: warning: data definition has no type or storage class [enabled by default]
/usr/src/modules/xtables-addons/compat_xtables.c:616:1: warning: type defaults to âintâ in declaration of âEXPORT_SYMBOL_GPLâ [-Wimplicit-int]
/usr/src/modules/xtables-addons/compat_xtables.c:616:1: warning: parameter names (without types) in function declaration [enabled by default]
/usr/src/modules/xtables-addons/compat_xtables.c:618:16: error: expected declaration specifiers or â...â before string constant
cc1: some warnings being treated as errors
make[4]: *** [/usr/src/modules/xtables-addons/compat_xtables.o] Error 1
make[3]: *** [_module_/usr/src/modules/xtables-addons] Error 2
make[3]: Leaving directory `/usr/src/linux-headers-3.2.0-22-generic'
dh_auto_build: make -j1 -C /usr/src/linux-headers-3.2.0-22-generic M=/usr/src/modules/xtables-addons XA_ABSTOPSRCDIR=/usr/src/modules/xtables-addons XA_TOPSRCDIR=/usr/src/modules/xtables-addons DEPMOD=/bin/true returned exit code 2
make[2]: *** [override_dh_auto_build] Error 2
make[2]: Leaving directory `/usr/src/modules/xtables-addons'
make[1]: *** [binary-modules] Error 2
make[1]: Leaving directory `/usr/src/modules/xtables-addons'
make: *** [kdist_build] Error 2
/usr/bin/make -C /usr/src/linux M=/usr/src/modules/xtables-addons XA_ABSTOPSRCDIR=/usr/src/modules/xtables-addons XA_TOPSRCDIR=/usr/src/modules/xtables-addons DEPMOD=/bin/true clean
make[1]: Entering directory `/usr/src/linux-headers-3.2.0-22-generic'
  CLEAN /usr/src/modules/xtables-addons/.tmp_versions
make[1]: Leaving directory `/usr/src/linux-headers-3.2.0-22-generic'
dh_auto_clean
dh_prep
dh_clean
/usr/bin/make -f debian/rules kdist_clean kdist_config binary-modules
make[1]: Entering directory `/usr/src/modules/xtables-addons'
/usr/bin/make -C /usr/src/linux M=/usr/src/modules/xtables-addons XA_ABSTOPSRCDIR=/usr/src/modules/xtables-addons XA_TOPSRCDIR=/usr/src/modules/xtables-addons DEPMOD=/bin/true clean
make[2]: Entering directory `/usr/src/linux-headers-3.2.0-22-generic'
make[2]: Leaving directory `/usr/src/linux-headers-3.2.0-22-generic'
dh_auto_clean
dh_prep
dh_clean
for templ in ; do \
    cp $templ `echo $templ | sed -e 's/_KVERS_/3.2.0-22-generic/g'` ; \
  done
for templ in `ls debian/*.modules.in` ; do \
    test -e ${templ%.modules.in}.backup || cp ${templ%.modules.in} ${templ%.modules.in}.backup 2>/dev/null || true; \
    sed -e 's/##KVERS##/3.2.0-22-generic/g ;s/#KVERS#/3.2.0-22-generic/g ; s/_KVERS_/3.2.0-22-generic/g ; s/##KDREV##/3.2.0-22.35/g ; s/#KDREV#/3.2.0-22.35/g ; s/_KDREV_/3.2.0-22.35/g ' < $templ > ${templ%.modules.in}; \
  done
dh binary-arch
   dh_testdir -a
   dh_auto_configure -a
   debian/rules override_dh_auto_build
make[2]: Entering directory `/usr/src/modules/xtables-addons'
dh_auto_build -- -C /usr/src/linux M=/usr/src/modules/xtables-addons XA_ABSTOPSRCDIR=/usr/src/modules/xtables-addons XA_TOPSRCDIR=/usr/src/modules/xtables-addons DEPMOD=/bin/true
make[3]: Entering directory `/usr/src/linux-headers-3.2.0-22-generic'
  LD /usr/src/modules/xtables-addons/built-in.o
  CC [M] /usr/src/modules/xtables-addons/compat_xtables.o
/usr/src/modules/xtables-addons/compat_xtables.c:403:1: warning: data definition has no type or storage class [enabled by default]
/usr/src/modules/xtables-addons/compat_xtables.c:403:1: warning: type defaults to âintâ in declaration of âEXPORT_SYMBOL_GPLâ [-Wimplicit-int]
/usr/src/modules/xtables-addons/compat_xtables.c:403:1: warning: parameter names (without types) in function declaration [enabled by default]
/usr/src/modules/xtables-addons/compat_xtables.c:420:1: warning: data definition has no type or storage class [enabled by default]
/usr/src/modules/xtables-addons/compat_xtables.c:420:1: warning: type defaults to âintâ in declaration of âEXPORT_SYMBOL_GPLâ [-Wimplicit-int]
/usr/src/modules/xtables-addons/compat_xtables.c:420:1: warning: parameter names (without types) in function declaration [enabled by default]
/usr/src/modules/xtables-addons/compat_xtables.c:427:1: warning: data definition has no type or storage class [enabled by default]
/usr/src/modules/xtables-addons/compat_xtables.c:427:1: warning: type defaults to âintâ in declaration of âEXPORT_SYMBOL_GPLâ [-Wimplicit-int]
/usr/src/modules/xtables-addons/compat_xtables.c:427:1: warning: parameter names (without types) in function declaration [enabled by default]
/usr/src/modules/xtables-addons/compat_xtables.c:436:1: warning: data definition has no type or storage class [enabled by default]
/usr/src/modules/xtables-addons/compat_xtables.c:436:1: warning: type defaults to âintâ in declaration of âEXPORT_SYMBOL_GPLâ [-Wimplicit-int]
/usr/src/modules/xtables-addons/compat_xtables.c:436:1: warning: parameter names (without types) in function declaration [enabled by default]
/usr/src/modules/xtables-addons/compat_xtables.c: In function âxtnu_request_find_matchâ:
/usr/src/modules/xtables-addons/compat_xtables.c:453:2: error: implicit declaration of function âtry_then_request_moduleâ [-Werror=implicit-function-declaration]
/usr/src/modules/xtables-addons/compat_xtables.c:453:8: warning: assignment makes pointer from integer without a cast [enabled by default]
/usr/src/modules/xtables-addons/compat_xtables.c: At top level:
/usr/src/modules/xtables-addons/compat_xtables.c:460:1: warning: data definition has no type or storage class [enabled by default]
/usr/src/modules/xtables-addons/compat_xtables.c:460:1: warning: type defaults to âintâ in declaration of âEXPORT_SYMBOL_GPLâ [-Wimplicit-int]
/usr/src/modules/xtables-addons/compat_xtables.c:460:1: warning: parameter names (without types) in function declaration [enabled by default]
/usr/src/modules/xtables-addons/compat_xtables.c:473:1: warning: data definition has no type or storage class [enabled by default]
/usr/src/modules/xtables-addons/compat_xtables.c:473:1: warning: type defaults to âintâ in declaration of âEXPORT_SYMBOL_GPLâ [-Wimplicit-int]
/usr/src/modules/xtables-addons/compat_xtables.c:473:1: warning: parameter names (without types) in function declaration [enabled by default]
/usr/src/modules/xtables-addons/compat_xtables.c:483:1: warning: data definition has no type or storage class [enabled by default]
/usr/src/modules/xtables-addons/compat_xtables.c:483:1: warning: type defaults to âintâ in declaration of âEXPORT_SYMBOL_GPLâ [-Wimplicit-int]
/usr/src/modules/xtables-addons/compat_xtables.c:483:1: warning: parameter names (without types) in function declaration [enabled by default]
/usr/src/modules/xtables-addons/compat_xtables.c:616:1: warning: data definition has no type or storage class [enabled by default]
/usr/src/modules/xtables-addons/compat_xtables.c:616:1: warning: type defaults to âintâ in declaration of âEXPORT_SYMBOL_GPLâ [-Wimplicit-int]
/usr/src/modules/xtables-addons/compat_xtables.c:616:1: warning: parameter names (without types) in function declaration [enabled by default]
/usr/src/modules/xtables-addons/compat_xtables.c:618:16: error: expected declaration specifiers or â...â before string constant
cc1: some warnings being treated as errors
make[4]: *** [/usr/src/modules/xtables-addons/compat_xtables.o] Error 1
make[3]: *** [_module_/usr/src/modules/xtables-addons] Error 2
make[3]: Leaving directory `/usr/src/linux-headers-3.2.0-22-generic'
dh_auto_build: make -j1 -C /usr/src/linux M=/usr/src/modules/xtables-addons XA_ABSTOPSRCDIR=/usr/src/modules/xtables-addons XA_TOPSRCDIR=/usr/src/modules/xtables-addons DEPMOD=/bin/true returned exit code 2
make[2]: *** [override_dh_auto_build] Error 2
make[2]: Leaving directory `/usr/src/modules/xtables-addons'
make[1]: *** [binary-modules] Error 2
make[1]: Leaving directory `/usr/src/modules/xtables-addons'
make: *** [kdist_build] Error 2
/usr/bin/make -C /usr/src/linux M=/usr/src/modules/xtables-addons XA_ABSTOPSRCDIR=/usr/src/modules/xtables-addons XA_TOPSRCDIR=/usr/src/modules/xtables-addons DEPMOD=/bin/true clean
make[1]: Entering directory `/usr/src/linux-headers-3.2.0-22-generic'
  CLEAN /usr/src/modules/xtables-addons/.tmp_versions
make[1]: Leaving directory `/usr/src/linux-headers-3.2.0-22-generic'
dh_auto_clean
dh_prep
dh_clean
/usr/bin/make -f debian/rules kdist_clean kdist_config binary-modules
make[1]: Entering directory `/usr/src/modules/xtables-addons'
/usr/bin/make -C /usr/src/linux M=/usr/src/modules/xtables-addons XA_ABSTOPSRCDIR=/usr/src/modules/xtables-addons XA_TOPSRCDIR=/usr/src/modules/xtables-addons DEPMOD=/bin/true clean
make[2]: Entering directory `/usr/src/linux-headers-3.2.0-22-generic'
make[2]: Leaving directory `/usr/src/linux-headers-3.2.0-22-generic'
dh_auto_clean
dh_prep
dh_clean
for templ in ; do \
    cp $templ `echo $templ | sed -e 's/_KVERS_/3.2.0-22-generic/g'` ; \
  done
for templ in `ls debian/*.modules.in` ; do \
    test -e ${templ%.modules.in}.backup || cp ${templ%.modules.in} ${templ%.modules.in}.backup 2>/dev/null || true; \
    sed -e 's/##KVERS##/3.2.0-22-generic/g ;s/#KVERS#/3.2.0-22-generic/g ; s/_KVERS_/3.2.0-22-generic/g ; s/##KDREV##/3.2.0-22.35/g ; s/#KDREV#/3.2.0-22.35/g ; s/_KDREV_/3.2.0-22.35/g ' < $templ > ${templ%.modules.in}; \
  done
dh binary-arch
   dh_testdir -a
   dh_auto_configure -a
   debian/rules override_dh_auto_build
make[2]: Entering directory `/usr/src/modules/xtables-addons'
dh_auto_build -- -C /usr/src/linux M=/usr/src/modules/xtables-addons XA_ABSTOPSRCDIR=/usr/src/modules/xtables-addons XA_TOPSRCDIR=/usr/src/modules/xtables-addons DEPMOD=/bin/true
make[3]: Entering directory `/usr/src/linux-headers-3.2.0-22-generic'
  LD /usr/src/modules/xtables-addons/built-in.o
  CC [M] /usr/src/modules/xtables-addons/compat_xtables.o
/usr/src/modules/xtables-addons/compat_xtables.c:403:1: warning: data definition has no type or storage class [enabled by default]
/usr/src/modules/xtables-addons/compat_xtables.c:403:1: warning: type defaults to âintâ in declaration of âEXPORT_SYMBOL_GPLâ [-Wimplicit-int]
/usr/src/modules/xtables-addons/compat_xtables.c:403:1: warning: parameter names (without types) in function declaration [enabled by default]
/usr/src/modules/xtables-addons/compat_xtables.c:420:1: warning: data definition has no type or storage class [enabled by default]
/usr/src/modules/xtables-addons/compat_xtables.c:420:1: warning: type defaults to âintâ in declaration of âEXPORT_SYMBOL_GPLâ [-Wimplicit-int]
/usr/src/modules/xtables-addons/compat_xtables.c:420:1: warning: parameter names (without types) in function declaration [enabled by default]
/usr/src/modules/xtables-addons/compat_xtables.c:427:1: warning: data definition has no type or storage class [enabled by default]
/usr/src/modules/xtables-addons/compat_xtables.c:427:1: warning: type defaults to âintâ in declaration of âEXPORT_SYMBOL_GPLâ [-Wimplicit-int]
/usr/src/modules/xtables-addons/compat_xtables.c:427:1: warning: parameter names (without types) in function declaration [enabled by default]
/usr/src/modules/xtables-addons/compat_xtables.c:436:1: warning: data definition has no type or storage class [enabled by default]
/usr/src/modules/xtables-addons/compat_xtables.c:436:1: warning: type defaults to âintâ in declaration of âEXPORT_SYMBOL_GPLâ [-Wimplicit-int]
/usr/src/modules/xtables-addons/compat_xtables.c:436:1: warning: parameter names (without types) in function declaration [enabled by default]
/usr/src/modules/xtables-addons/compat_xtables.c: In function âxtnu_request_find_matchâ:
/usr/src/modules/xtables-addons/compat_xtables.c:453:2: error: implicit declaration of function âtry_then_request_moduleâ [-Werror=implicit-function-declaration]
/usr/src/modules/xtables-addons/compat_xtables.c:453:8: warning: assignment makes pointer from integer without a cast [enabled by default]
/usr/src/modules/xtables-addons/compat_xtables.c: At top level:
/usr/src/modules/xtables-addons/compat_xtables.c:460:1: warning: data definition has no type or storage class [enabled by default]
/usr/src/modules/xtables-addons/compat_xtables.c:460:1: warning: type defaults to âintâ in declaration of âEXPORT_SYMBOL_GPLâ [-Wimplicit-int]
/usr/src/modules/xtables-addons/compat_xtables.c:460:1: warning: parameter names (without types) in function declaration [enabled by default]
/usr/src/modules/xtables-addons/compat_xtables.c:473:1: warning: data definition has no type or storage class [enabled by default]
/usr/src/modules/xtables-addons/compat_xtables.c:473:1: warning: type defaults to âintâ in declaration of âEXPORT_SYMBOL_GPLâ [-Wimplicit-int]
/usr/src/modules/xtables-addons/compat_xtables.c:473:1: warning: parameter names (without types) in function declaration [enabled by default]
/usr/src/modules/xtables-addons/compat_xtables.c:483:1: warning: data definition has no type or storage class [enabled by default]
/usr/src/modules/xtables-addons/compat_xtables.c:483:1: warning: type defaults to âintâ in declaration of âEXPORT_SYMBOL_GPLâ [-Wimplicit-int]
/usr/src/modules/xtables-addons/compat_xtables.c:483:1: warning: parameter names (without types) in function declaration [enabled by default]
/usr/src/modules/xtables-addons/compat_xtables.c:616:1: warning: data definition has no type or storage class [enabled by default]
/usr/src/modules/xtables-addons/compat_xtables.c:616:1: warning: type defaults to âintâ in declaration of âEXPORT_SYMBOL_GPLâ [-Wimplicit-int]
/usr/src/modules/xtables-addons/compat_xtables.c:616:1: warning: parameter names (without types) in function declaration [enabled by default]
/usr/src/modules/xtables-addons/compat_xtables.c:618:16: error: expected declaration specifiers or â...â before string constant
cc1: some warnings being treated as errors
make[4]: *** [/usr/src/modules/xtables-addons/compat_xtables.o] Error 1
make[3]: *** [_module_/usr/src/modules/xtables-addons] Error 2
make[3]: Leaving directory `/usr/src/linux-headers-3.2.0-22-generic'
dh_auto_build: make -j1 -C /usr/src/linux M=/usr/src/modules/xtables-addons XA_ABSTOPSRCDIR=/usr/src/modules/xtables-addons XA_TOPSRCDIR=/usr/src/modules/xtables-addons DEPMOD=/bin/true returned exit code 2
make[2]: *** [override_dh_auto_build] Error 2
make[2]: Leaving directory `/usr/src/modules/xtables-addons'
make[1]: *** [binary-modules] Error 2
make[1]: Leaving directory `/usr/src/modules/xtables-addons'
make: *** [kdist_build] Error 2
/usr/bin/make -C /usr/src/linux M=/usr/src/modules/xtables-addons XA_ABSTOPSRCDIR=/usr/src/modules/xtables-addons XA_TOPSRCDIR=/usr/src/modules/xtables-addons DEPMOD=/bin/true clean
make[1]: Entering directory `/usr/src/linux-headers-3.2.0-22-generic'
  CLEAN /usr/src/modules/xtables-addons/.tmp_versions
make[1]: Leaving directory `/usr/src/linux-headers-3.2.0-22-generic'
dh_auto_clean
dh_prep
dh_clean
/usr/bin/make -f debian/rules kdist_clean kdist_config binary-modules
make[1]: Entering directory `/usr/src/modules/xtables-addons'
/usr/bin/make -C /usr/src/linux M=/usr/src/modules/xtables-addons XA_ABSTOPSRCDIR=/usr/src/modules/xtables-addons XA_TOPSRCDIR=/usr/src/modules/xtables-addons DEPMOD=/bin/true clean
make[2]: Entering directory `/usr/src/linux-headers-3.2.0-22-generic'
make[2]: Leaving directory `/usr/src/linux-headers-3.2.0-22-generic'
dh_auto_clean
dh_prep
dh_clean
for templ in ; do \
    cp $templ `echo $templ | sed -e 's/_KVERS_/3.2.0-22-generic/g'` ; \
  done
for templ in `ls debian/*.modules.in` ; do \
    test -e ${templ%.modules.in}.backup || cp ${templ%.modules.in} ${templ%.modules.in}.backup 2>/dev/null || true; \
    sed -e 's/##KVERS##/3.2.0-22-generic/g ;s/#KVERS#/3.2.0-22-generic/g ; s/_KVERS_/3.2.0-22-generic/g ; s/##KDREV##/3.2.0-22.35/g ; s/#KDREV#/3.2.0-22.35/g ; s/_KDREV_/3.2.0-22.35/g ' < $templ > ${templ%.modules.in}; \
  done
dh binary-arch
   dh_testdir -a
   dh_auto_configure -a
   debian/rules override_dh_auto_build
make[2]: Entering directory `/usr/src/modules/xtables-addons'
dh_auto_build -- -C /usr/src/linux M=/usr/src/modules/xtables-addons XA_ABSTOPSRCDIR=/usr/src/modules/xtables-addons XA_TOPSRCDIR=/usr/src/modules/xtables-addons DEPMOD=/bin/true
make[3]: Entering directory `/usr/src/linux-headers-3.2.0-22-generic'
  LD /usr/src/modules/xtables-addons/built-in.o
  CC [M] /usr/src/modules/xtables-addons/compat_xtables.o
/usr/src/modules/xtables-addons/compat_xtables.c:403:1: warning: data definition has no type or storage class [enabled by default]
/usr/src/modules/xtables-addons/compat_xtables.c:403:1: warning: type defaults to âintâ in declaration of âEXPORT_SYMBOL_GPLâ [-Wimplicit-int]
/usr/src/modules/xtables-addons/compat_xtables.c:403:1: warning: parameter names (without types) in function declaration [enabled by default]
/usr/src/modules/xtables-addons/compat_xtables.c:420:1: warning: data definition has no type or storage class [enabled by default]
/usr/src/modules/xtables-addons/compat_xtables.c:420:1: warning: type defaults to âintâ in declaration of âEXPORT_SYMBOL_GPLâ [-Wimplicit-int]
/usr/src/modules/xtables-addons/compat_xtables.c:420:1: warning: parameter names (without types) in function declaration [enabled by default]
/usr/src/modules/xtables-addons/compat_xtables.c:427:1: warning: data definition has no type or storage class [enabled by default]
/usr/src/modules/xtables-addons/compat_xtables.c:427:1: warning: type defaults to âintâ in declaration of âEXPORT_SYMBOL_GPLâ [-Wimplicit-int]
/usr/src/modules/xtables-addons/compat_xtables.c:427:1: warning: parameter names (without types) in function declaration [enabled by default]
/usr/src/modules/xtables-addons/compat_xtables.c:436:1: warning: data definition has no type or storage class [enabled by default]
/usr/src/modules/xtables-addons/compat_xtables.c:436:1: warning: type defaults to âintâ in declaration of âEXPORT_SYMBOL_GPLâ [-Wimplicit-int]
/usr/src/modules/xtables-addons/compat_xtables.c:436:1: warning: parameter names (without types) in function declaration [enabled by default]
/usr/src/modules/xtables-addons/compat_xtables.c: In function âxtnu_request_find_matchâ:
/usr/src/modules/xtables-addons/compat_xtables.c:453:2: error: implicit declaration of function âtry_then_request_moduleâ [-Werror=implicit-function-declaration]
/usr/src/modules/xtables-addons/compat_xtables.c:453:8: warning: assignment makes pointer from integer without a cast [enabled by default]
/usr/src/modules/xtables-addons/compat_xtables.c: At top level:
/usr/src/modules/xtables-addons/compat_xtables.c:460:1: warning: data definition has no type or storage class [enabled by default]
/usr/src/modules/xtables-addons/compat_xtables.c:460:1: warning: type defaults to âintâ in declaration of âEXPORT_SYMBOL_GPLâ [-Wimplicit-int]
/usr/src/modules/xtables-addons/compat_xtables.c:460:1: warning: parameter names (without types) in function declaration [enabled by default]
/usr/src/modules/xtables-addons/compat_xtables.c:473:1: warning: data definition has no type or storage class [enabled by default]
/usr/src/modules/xtables-addons/compat_xtables.c:473:1: warning: type defaults to âintâ in declaration of âEXPORT_SYMBOL_GPLâ [-Wimplicit-int]
/usr/src/modules/xtables-addons/compat_xtables.c:473:1: warning: parameter names (without types) in function declaration [enabled by default]
/usr/src/modules/xtables-addons/compat_xtables.c:483:1: warning: data definition has no type or storage class [enabled by default]
/usr/src/modules/xtables-addons/compat_xtables.c:483:1: warning: type defaults to âintâ in declaration of âEXPORT_SYMBOL_GPLâ [-Wimplicit-int]
/usr/src/modules/xtables-addons/compat_xtables.c:483:1: warning: parameter names (without types) in function declaration [enabled by default]
/usr/src/modules/xtables-addons/compat_xtables.c:616:1: warning: data definition has no type or storage class [enabled by default]
/usr/src/modules/xtables-addons/compat_xtables.c:616:1: warning: type defaults to âintâ in declaration of âEXPORT_SYMBOL_GPLâ [-Wimplicit-int]
/usr/src/modules/xtables-addons/compat_xtables.c:616:1: warning: parameter names (without types) in function declaration [enabled by default]
/usr/src/modules/xtables-addons/compat_xtables.c:618:16: error: expected declaration specifiers or â...â before string constant
cc1: some warnings being treated as errors
make[4]: *** [/usr/src/modules/xtables-addons/compat_xtables.o] Error 1
make[3]: *** [_module_/usr/src/modules/xtables-addons] Error 2
make[3]: Leaving directory `/usr/src/linux-headers-3.2.0-22-generic'
dh_auto_build: make -j1 -C /usr/src/linux M=/usr/src/modules/xtables-addons XA_ABSTOPSRCDIR=/usr/src/modules/xtables-addons XA_TOPSRCDIR=/usr/src/modules/xtables-addons DEPMOD=/bin/true returned exit code 2
make[2]: *** [override_dh_auto_build] Error 2
make[2]: Leaving directory `/usr/src/modules/xtables-addons'
make[1]: *** [binary-modules] Error 2
make[1]: Leaving directory `/usr/src/modules/xtables-addons'
make: *** [kdist_build] Error 2
/usr/bin/make -C /usr/src/linux M=/usr/src/modules/xtables-addons XA_ABSTOPSRCDIR=/usr/src/modules/xtables-addons XA_TOPSRCDIR=/usr/src/modules/xtables-addons DEPMOD=/bin/true clean
make[1]: Entering directory `/usr/src/linux-headers-3.2.0-22-generic'
  CLEAN /usr/src/modules/xtables-addons/.tmp_versions
make[1]: Leaving directory `/usr/src/linux-headers-3.2.0-22-generic'
dh_auto_clean
dh_prep
dh_clean
/usr/bin/make -f debian/rules kdist_clean kdist_config binary-modules
make[1]: Entering directory `/usr/src/modules/xtables-addons'
/usr/bin/make -C /usr/src/linux M=/usr/src/modules/xtables-addons XA_ABSTOPSRCDIR=/usr/src/modules/xtables-addons XA_TOPSRCDIR=/usr/src/modules/xtables-addons DEPMOD=/bin/true clean
make[2]: Entering directory `/usr/src/linux-headers-3.2.0-22-generic'
make[2]: Leaving directory `/usr/src/linux-headers-3.2.0-22-generic'
dh_auto_clean
dh_prep
dh_clean
for templ in ; do \
    cp $templ `echo $templ | sed -e 's/_KVERS_/3.2.0-22-generic/g'` ; \
  done
for templ in `ls debian/*.modules.in` ; do \
    test -e ${templ%.modules.in}.backup || cp ${templ%.modules.in} ${templ%.modules.in}.backup 2>/dev/null || true; \
    sed -e 's/##KVERS##/3.2.0-22-generic/g ;s/#KVERS#/3.2.0-22-generic/g ; s/_KVERS_/3.2.0-22-generic/g ; s/##KDREV##/3.2.0-22.35/g ; s/#KDREV#/3.2.0-22.35/g ; s/_KDREV_/3.2.0-22.35/g ' < $templ > ${templ%.modules.in}; \
  done
dh binary-arch
   dh_testdir -a
   dh_auto_configure -a
   debian/rules override_dh_auto_build
make[2]: Entering directory `/usr/src/modules/xtables-addons'
dh_auto_build -- -C /usr/src/linux M=/usr/src/modules/xtables-addons XA_ABSTOPSRCDIR=/usr/src/modules/xtables-addons XA_TOPSRCDIR=/usr/src/modules/xtables-addons DEPMOD=/bin/true
make[3]: Entering directory `/usr/src/linux-headers-3.2.0-22-generic'
  LD /usr/src/modules/xtables-addons/built-in.o
  CC [M] /usr/src/modules/xtables-addons/compat_xtables.o
/usr/src/modules/xtables-addons/compat_xtables.c:403:1: warning: data definition has no type or storage class [enabled by default]
/usr/src/modules/xtables-addons/compat_xtables.c:403:1: warning: type defaults to âintâ in declaration of âEXPORT_SYMBOL_GPLâ [-Wimplicit-int]
/usr/src/modules/xtables-addons/compat_xtables.c:403:1: warning: parameter names (without types) in function declaration [enabled by default]
/usr/src/modules/xtables-addons/compat_xtables.c:420:1: warning: data definition has no type or storage class [enabled by default]
/usr/src/modules/xtables-addons/compat_xtables.c:420:1: warning: type defaults to âintâ in declaration of âEXPORT_SYMBOL_GPLâ [-Wimplicit-int]
/usr/src/modules/xtables-addons/compat_xtables.c:420:1: warning: parameter names (without types) in function declaration [enabled by default]
/usr/src/modules/xtables-addons/compat_xtables.c:427:1: warning: data definition has no type or storage class [enabled by default]
/usr/src/modules/xtables-addons/compat_xtables.c:427:1: warning: type defaults to âintâ in declaration of âEXPORT_SYMBOL_GPLâ [-Wimplicit-int]
/usr/src/modules/xtables-addons/compat_xtables.c:427:1: warning: parameter names (without types) in function declaration [enabled by default]
/usr/src/modules/xtables-addons/compat_xtables.c:436:1: warning: data definition has no type or storage class [enabled by default]
/usr/src/modules/xtables-addons/compat_xtables.c:436:1: warning: type defaults to âintâ in declaration of âEXPORT_SYMBOL_GPLâ [-Wimplicit-int]
/usr/src/modules/xtables-addons/compat_xtables.c:436:1: warning: parameter names (without types) in function declaration [enabled by default]
/usr/src/modules/xtables-addons/compat_xtables.c: In function âxtnu_request_find_matchâ:
/usr/src/modules/xtables-addons/compat_xtables.c:453:2: error: implicit declaration of function âtry_then_request_moduleâ [-Werror=implicit-function-declaration]
/usr/src/modules/xtables-addons/compat_xtables.c:453:8: warning: assignment makes pointer from integer without a cast [enabled by default]
/usr/src/modules/xtables-addons/compat_xtables.c: At top level:
/usr/src/modules/xtables-addons/compat_xtables.c:460:1: warning: data definition has no type or storage class [enabled by default]
/usr/src/modules/xtables-addons/compat_xtables.c:460:1: warning: type defaults to âintâ in declaration of âEXPORT_SYMBOL_GPLâ [-Wimplicit-int]
/usr/src/modules/xtables-addons/compat_xtables.c:460:1: warning: parameter names (without types) in function declaration [enabled by default]
/usr/src/modules/xtables-addons/compat_xtables.c:473:1: warning: data definition has no type or storage class [enabled by default]
/usr/src/modules/xtables-addons/compat_xtables.c:473:1: warning: type defaults to âintâ in declaration of âEXPORT_SYMBOL_GPLâ [-Wimplicit-int]
/usr/src/modules/xtables-addons/compat_xtables.c:473:1: warning: parameter names (without types) in function declaration [enabled by default]
/usr/src/modules/xtables-addons/compat_xtables.c:483:1: warning: data definition has no type or storage class [enabled by default]
/usr/src/modules/xtables-addons/compat_xtables.c:483:1: warning: type defaults to âintâ in declaration of âEXPORT_SYMBOL_GPLâ [-Wimplicit-int]
/usr/src/modules/xtables-addons/compat_xtables.c:483:1: warning: parameter names (without types) in function declaration [enabled by default]
/usr/src/modules/xtables-addons/compat_xtables.c:616:1: warning: data definition has no type or storage class [enabled by default]
/usr/src/modules/xtables-addons/compat_xtables.c:616:1: warning: type defaults to âintâ in declaration of âEXPORT_SYMBOL_GPLâ [-Wimplicit-int]
/usr/src/modules/xtables-addons/compat_xtables.c:616:1: warning: parameter names (without types) in function declaration [enabled by default]
cc1: some warnings being treated as errors
make[4]: *** [/usr/src/modules/xtables-addons/compat_xtables.o] Error 1
make[3]: *** [_module_/usr/src/modules/xtables-addons] Error 2
make[3]: Leaving directory `/usr/src/linux-headers-3.2.0-22-generic'
dh_auto_build: make -j1 -C /usr/src/linux M=/usr/src/modules/xtables-addons XA_ABSTOPSRCDIR=/usr/src/modules/xtables-addons XA_TOPSRCDIR=/usr/src/modules/xtables-addons DEPMOD=/bin/true returned exit code 2
make[2]: *** [override_dh_auto_build] Error 2
make[2]: Leaving directory `/usr/src/modules/xtables-addons'
make[1]: *** [binary-modules] Error 2
make[1]: Leaving directory `/usr/src/modules/xtables-addons'
make: *** [kdist_build] Error 2
/usr/bin/make -C /usr/src/linux-headers-3.2.0-22-generic M=/usr/src/modules/xtables-addons XA_ABSTOPSRCDIR=/usr/src/modules/xtables-addons XA_TOPSRCDIR=/usr/src/modules/xtables-addons DEPMOD=/bin/true clean
make[1]: Entering directory `/usr/src/linux-headers-3.2.0-22-generic'
  CLEAN /usr/src/modules/xtables-addons/.tmp_versions
make[1]: Leaving directory `/usr/src/linux-headers-3.2.0-22-generic'
dh_auto_clean
dh_prep
dh_clean
/usr/bin/make -f debian/rules kdist_clean kdist_config binary-modules
make[1]: Entering directory `/usr/src/modules/xtables-addons'
/usr/bin/make -C /usr/src/linux-headers-3.2.0-22-generic M=/usr/src/modules/xtables-addons XA_ABSTOPSRCDIR=/usr/src/modules/xtables-addons XA_TOPSRCDIR=/usr/src/modules/xtables-addons DEPMOD=/bin/true clean
make[2]: Entering directory `/usr/src/linux-headers-3.2.0-22-generic'
make[2]: Leaving directory `/usr/src/linux-headers-3.2.0-22-generic'
dh_auto_clean
dh_prep
dh_clean
for templ in ; do \
    cp $templ `echo $templ | sed -e 's/_KVERS_/3.2.0-22-generic/g'` ; \
  done
for templ in `ls debian/*.modules.in` ; do \
    test -e ${templ%.modules.in}.backup || cp ${templ%.modules.in} ${templ%.modules.in}.backup 2>/dev/null || true; \
    sed -e 's/##KVERS##/3.2.0-22-generic/g ;s/#KVERS#/3.2.0-22-generic/g ; s/_KVERS_/3.2.0-22-generic/g ; s/##KDREV##/3.2.0-22.35/g ; s/#KDREV#/3.2.0-22.35/g ; s/_KDREV_/3.2.0-22.35/g ' < $templ > ${templ%.modules.in}; \
  done
dh binary-arch
   dh_testdir -a
   dh_auto_configure -a
   debian/rules override_dh_auto_build
make[2]: Entering directory `/usr/src/modules/xtables-addons'
dh_auto_build -- -C /usr/src/linux-headers-3.2.0-22-generic M=/usr/src/modules/xtables-addons XA_ABSTOPSRCDIR=/usr/src/modules/xtables-addons XA_TOPSRCDIR=/usr/src/modules/xtables-addons DEPMOD=/bin/true
make[3]: Entering directory `/usr/src/linux-headers-3.2.0-22-generic'
  LD /usr/src/modules/xtables-addons/built-in.o
  CC [M] /usr/src/modules/xtables-addons/compat_xtables.o
/usr/src/modules/xtables-addons/compat_xtables.c:403:1: warning: data definition has no type or storage class [enabled by default]
/usr/src/modules/xtables-addons/compat_xtables.c:403:1: warning: type defaults to âintâ in declaration of âEXPORT_SYMBOL_GPLâ [-Wimplicit-int]
/usr/src/modules/xtables-addons/compat_xtables.c:403:1: warning: parameter names (without types) in function declaration [enabled by default]
/usr/src/modules/xtables-addons/compat_xtables.c:420:1: warning: data definition has no type or storage class [enabled by default]
/usr/src/modules/xtables-addons/compat_xtables.c:420:1: warning: type defaults to âintâ in declaration of âEXPORT_SYMBOL_GPLâ [-Wimplicit-int]
/usr/src/modules/xtables-addons/compat_xtables.c:420:1: warning: parameter names (without types) in function declaration [enabled by default]
/usr/src/modules/xtables-addons/compat_xtables.c:427:1: warning: data definition has no type or storage class [enabled by default]
/usr/src/modules/xtables-addons/compat_xtables.c:427:1: warning: type defaults to âintâ in declaration of âEXPORT_SYMBOL_GPLâ [-Wimplicit-int]
/usr/src/modules/xtables-addons/compat_xtables.c:427:1: warning: parameter names (without types) in function declaration [enabled by default]
/usr/src/modules/xtables-addons/compat_xtables.c:436:1: warning: data definition has no type or storage class [enabled by default]
/usr/src/modules/xtables-addons/compat_xtables.c:436:1: warning: type defaults to âintâ in declaration of âEXPORT_SYMBOL_GPLâ [-Wimplicit-int]
/usr/src/modules/xtables-addons/compat_xtables.c:436:1: warning: parameter names (without types) in function declaration [enabled by default]
/usr/src/modules/xtables-addons/compat_xtables.c: In function âxtnu_request_find_matchâ:
/usr/src/modules/xtables-addons/compat_xtables.c:453:2: error: implicit declaration of function âtry_then_request_moduleâ [-Werror=implicit-function-declaration]
/usr/src/modules/xtables-addons/compat_xtables.c:453:8: warning: assignment makes pointer from integer without a cast [enabled by default]
/usr/src/modules/xtables-addons/compat_xtables.c: At top level:
/usr/src/modules/xtables-addons/compat_xtables.c:460:1: warning: data definition has no type or storage class [enabled by default]
/usr/src/modules/xtables-addons/compat_xtables.c:460:1: warning: type defaults to âintâ in declaration of âEXPORT_SYMBOL_GPLâ [-Wimplicit-int]
/usr/src/modules/xtables-addons/compat_xtables.c:460:1: warning: parameter names (without types) in function declaration [enabled by default]
/usr/src/modules/xtables-addons/compat_xtables.c:473:1: warning: data definition has no type or storage class [enabled by default]
/usr/src/modules/xtables-addons/compat_xtables.c:473:1: warning: type defaults to âintâ in declaration of âEXPORT_SYMBOL_GPLâ [-Wimplicit-int]
/usr/src/modules/xtables-addons/compat_xtables.c:473:1: warning: parameter names (without types) in function declaration [enabled by default]
/usr/src/modules/xtables-addons/compat_xtables.c:483:1: warning: data definition has no type or storage class [enabled by default]
/usr/src/modules/xtables-addons/compat_xtables.c:483:1: warning: type defaults to âintâ in declaration of âEXPORT_SYMBOL_GPLâ [-Wimplicit-int]
/usr/src/modules/xtables-addons/compat_xtables.c:483:1: warning: parameter names (without types) in function declaration [enabled by default]
/usr/src/modules/xtables-addons/compat_xtables.c:616:1: warning: data definition has no type or storage class [enabled by default]
/usr/src/modules/xtables-addons/compat_xtables.c:616:1: warning: type defaults to âintâ in declaration of âEXPORT_SYMBOL_GPLâ [-Wimplicit-int]
/usr/src/modules/xtables-addons/compat_xtables.c:616:1: warning: parameter names (without types) in function declaration [enabled by default]
/usr/src/modules/xtables-addons/compat_xtables.c:618:16: error: expected declaration specifiers or â...â before string constant
cc1: some warnings being treated as errors
make[4]: *** [/usr/src/modules/xtables-addons/compat_xtables.o] Error 1
make[3]: *** [_module_/usr/src/modules/xtables-addons] Error 2
make[3]: Leaving directory `/usr/src/linux-headers-3.2.0-22-generic'
dh_auto_build: make -j1 -C /usr/src/linux-headers-3.2.0-22-generic M=/usr/src/modules/xtables-addons XA_ABSTOPSRCDIR=/usr/src/modules/xtables-addons XA_TOPSRCDIR=/usr/src/modules/xtables-addons DEPMOD=/bin/true returned exit code 2
make[2]: *** [override_dh_auto_build] Error 2
make[2]: Leaving directory `/usr/src/modules/xtables-addons'
make[1]: *** [binary-modules] Error 2
make[1]: Leaving directory `/usr/src/modules/xtables-addons'
make: *** [kdist_build] Error 2

ProblemType: Bug
DistroRelease: Ubuntu 12.04
Package: xtables-addons-source 1.40-1
ProcVersionSignature: Ubuntu 3.2.0-22.35-generic 3.2.14
Uname: Linux 3.2.0-22-generic x86_64
ApportVersion: 2.0-0ubuntu4
Architecture: amd64
Date: Sun Apr 8 23:04:10 2012
InstallationMedia: Ubuntu-Server 12.04 LTS "Precise Pangolin" - Alpha amd64 (20120315)
PackageArchitecture: all
ProcEnviron:
 LANGUAGE=en_GB:en
 TERM=xterm
 LANG=en_GB.UTF-8
 SHELL=/bin/bash
SourcePackage: xtables-addons
UpgradeStatus: No upgrade log present (probably fresh install)

Mark Honman (mark-honman) wrote :
To post a comment you must log in.
This report contains Public information  Edit
Everyone can see this information.

Other bug subscribers