Comment 9 for bug 1842437

Eric Desrochers (slashd) wrote :

@mfo,

Unfortunately the build ftbfs as follow:

https://launchpadlibrarian.net/443016838/buildlog_ubuntu-xenial-amd64.util-linux_2.27.1-6ubuntu3.9_BUILDING.txt.gz
.......
masks:
script: openpty failed: No such file or directory
Makefile:11211: recipe for target 'check-recursive' failed
make[3]: *** [check-recursive] Terminated
debian/rules:177: recipe for target 'override_dh_auto_test' failed
make[1]: *** [override_dh_auto_test] Terminated
debian/rules:54: recipe for target 'build' failed
make: *** [build] Terminated
E: Caught signal ‘Terminated’: terminating immediately
.......

Investigation is going to be needed.

- Eric