package rabbitmq-server 2.3.1-1ubuntu1 failed to install/upgrade: subprocess installed post-installation script returned error exit status 1

Bug #824767 reported by Iuri Diniz on 2011-08-11
10
This bug affects 2 people
Affects Status Importance Assigned to Milestone
rabbitmq-server (Ubuntu)
Low
Unassigned

Bug Description

RabbitMQ does not configure if there is something running under default installation port 61613

I think that is better do not start server after package installation.

ProblemType: PackageDistroRelease: Ubuntu 11.04
Package: rabbitmq-server 2.3.1-1ubuntu1
ProcVersionSignature: Ubuntu 2.6.38-10.46-generic 2.6.38.7
Uname: Linux 2.6.38-10-generic x86_64
Architecture: amd64
Date: Thu Aug 11 16:36:15 2011
ErrorMessage: subprocess installed post-installation script returned error exit status 1
PackageArchitecture: allSourcePackage: rabbitmq-server
Title: package rabbitmq-server 2.3.1-1ubuntu1 failed to install/upgrade: subprocess installed post-installation script returned error exit status 1UpgradeStatus: Upgraded to natty on 2011-04-29 (104 days ago)

Iuri Diniz (iuridiniz) wrote :
Dave Walker (davewalker) wrote :

Thanks for reporting this bug.

Out of interest, what service was running on port 61613?

Thanks.

Developer note:
The logic for starting the service probably needs to handle a failed start better, and not block package configure.

Setting up rabbitmq-server (2.3.1-1ubuntu1) ...
Adding group `rabbitmq' (GID 137) ...
Done.
Adding system user `rabbitmq' (UID 123) ...
Adding new user `rabbitmq' (UID 123) with group `rabbitmq' ...
Not creating home directory `/var/lib/rabbitmq'.
Starting rabbitmq-server: FAILED - check /var/log/rabbitmq/startup_log, _err
rabbitmq-server.
invoke-rc.d: initscript rabbitmq-server, action "start" failed.
dpkg: error processing rabbitmq-server (--configure):
 subprocess installed post-installation script returned error exit status 1

description: updated
Changed in rabbitmq-server (Ubuntu):
importance: Undecided → Low
status: New → Confirmed
Download full text (3.7 KiB)

Another stomp broker

I had wanted test different stomp brokers

On Thu, Aug 18, 2011 at 7:50 PM, Dave Walker <email address hidden> wrote:

> Thanks for reporting this bug.
>
> Out of interest, what service was running on port 61613?
>
> Thanks.
>
>
> Developer note:
> The logic for starting the service probably needs to handle a failed start
> better, and not block package configure.
>
> Setting up rabbitmq-server (2.3.1-1ubuntu1) ...
> Adding group `rabbitmq' (GID 137) ...
> Done.
> Adding system user `rabbitmq' (UID 123) ...
> Adding new user `rabbitmq' (UID 123) with group `rabbitmq' ...
> Not creating home directory `/var/lib/rabbitmq'.
> Starting rabbitmq-server: FAILED - check /var/log/rabbitmq/startup_log,
> _err
> rabbitmq-server.
> invoke-rc.d: initscript rabbitmq-server, action "start" failed.
> dpkg: error processing rabbitmq-server (--configure):
> subprocess installed post-installation script returned error exit status 1
>
>
>
> ** Description changed:
>
> RabbitMQ does not configure if there is something running under default
> installation port 61613
>
> - I think that is better do not start server after packet installation.
> + I think that is better do not start server after package installation.
>
> - ProblemType: Package
> - DistroRelease: Ubuntu 11.04
> + ProblemType: PackageDistroRelease: Ubuntu 11.04
> Package: rabbitmq-server 2.3.1-1ubuntu1
> ProcVersionSignature: Ubuntu 2.6.38-10.46-generic 2.6.38.7
> Uname: Linux 2.6.38-10-generic x86_64
> Architecture: amd64
> Date: Thu Aug 11 16:36:15 2011
> ErrorMessage: subprocess installed post-installation script returned error
> exit status 1
> - PackageArchitecture: all
> - SourcePackage: rabbitmq-server
> - Title: package rabbitmq-server 2.3.1-1ubuntu1 failed to install/upgrade:
> subprocess installed post-installation script returned error exit status 1
> - UpgradeStatus: Upgraded to natty on 2011-04-29 (104 days ago)
> + PackageArchitecture: allSourcePackage: rabbitmq-server
> + Title: package rabbitmq-server 2.3.1-1ubuntu1 failed to install/upgrade:
> subprocess installed post-installation script returned error exit status
> 1UpgradeStatus: Upgraded to natty on 2011-04-29 (104 days ago)
>
> ** Changed in: rabbitmq-server (Ubuntu)
> Importance: Undecided => Low
>
> ** Changed in: rabbitmq-server (Ubuntu)
> Status: New => Confirmed
>
> --
> You received this bug notification because you are subscribed to the bug
> report.
> https://bugs.launchpad.net/bugs/824767
>
> Title:
> package rabbitmq-server 2.3.1-1ubuntu1 failed to install/upgrade:
> subprocess installed post-installation script returned error exit
> status 1
>
> Status in “rabbitmq-server” package in Ubuntu:
> Confirmed
>
> Bug description:
> RabbitMQ does not configure if there is something running under
> default installation port 61613
>
> I think that is better do not start server after package installation.
>
> ProblemType: PackageDistroRelease: Ubuntu 11.04
> Package: rabbitmq-server 2.3.1-1ubuntu1
> ProcVersionSignature: Ubuntu 2.6.38-10.46-generic 2.6.38.7
> Uname: Linux 2.6.38-10-generic x86_64
> Architecture: amd64
> Date: Thu Aug 11 16:36:15 2011
> ErrorMessage: subp...

Read more...

Edina Varga (edina-varga) wrote :

I have similiar error, but nothing runs on port 61613.

Reading package lists... Done
Building dependency tree
Reading state information... Done
The following NEW packages will be installed:
  rabbitmq-server
0 upgraded, 1 newly installed, 0 to remove and 3 not upgraded.
Need to get 0 B/935 kB of archives.
After this operation, 1,683 kB of additional disk space will be used.
Selecting previously deselected package rabbitmq-server.
(Reading database ... 55446 files and directories currently installed.)
Unpacking rabbitmq-server (from .../rabbitmq-server_2.3.1-1ubuntu1_all.deb) ...
Processing triggers for man-db ...
Processing triggers for ureadahead ...
Setting up rabbitmq-server (2.3.1-1ubuntu1) ...
Starting rabbitmq-server: FAILED - check /var/log/rabbitmq/startup_log, _err
rabbitmq-server.
invoke-rc.d: initscript rabbitmq-server, action "start" failed.
dpkg: error processing rabbitmq-server (--configure):
 subprocess installed post-installation script returned error exit status 1
Errors were encountered while processing:
 rabbitmq-server
E: Sub-process /usr/bin/dpkg returned an error code (1)

/var/log/rabbitmq/startup_log contains only this one line:
Starting all nodes...

/var/log/dpkg.log
2011-10-13 15:12:07 startup packages configure
2011-10-13 15:12:07 configure rabbitmq-server 2.3.1-1ubuntu1 <none>
2011-10-13 15:12:07 status unpacked rabbitmq-server 2.3.1-1ubuntu1
2011-10-13 15:12:07 status unpacked rabbitmq-server 2.3.1-1ubuntu1
2011-10-13 15:12:07 status unpacked rabbitmq-server 2.3.1-1ubuntu1
2011-10-13 15:12:07 status half-configured rabbitmq-server 2.3.1-1ubuntu1

/var/log/rabbitmq/startup_err
Error: {cannot_connect_to_epmd,"node1",address}

dazza5000 (darran-kelinske) wrote :
Download full text (5.9 KiB)

Happening for me on 12.10:

After this operation, 0 B of additional disk space will be used.
Setting up rabbitmq-server (2.8.4-1) ...
 * Starting message broker rabbitmq-server * FAILED - check /var/log/rabbitmq/startup_\{log, _err\}
                                                                         [fail]
invoke-rc.d: initscript rabbitmq-server, action "start" failed.
dpkg: error processing rabbitmq-server (--configure):
 subprocess installed post-installation script returned error exit status 1
Errors were encountered while processing:
 rabbitmq-server
E: Sub-process /usr/bin/dpkg returned an error code (1)
Reading package lists... Done
Building dependency tree
Reading state information... Done
Calculating upgrade... Done
0 upgraded, 0 newly installed, 0 to remove and 0 not upgraded.
1 not fully installed or removed.
After this operation, 0 B of additional disk space will be used.
Setting up rabbitmq-server (2.8.4-1) ...
 * Starting message broker rabbitmq-server * FAILED - check /var/log/rabbitmq/startup_\{log, _err\}
                                                                         [fail]
invoke-rc.d: initscript rabbitmq-server, action "start" failed.
dpkg: error processing rabbitmq-server (--configure):
 subprocess installed post-installation script returned error exit status 1
No apport report written because MaxReports is reached already
                                                              Errors were encountered while processing:
 rabbitmq-server
E: Sub-process /usr/bin/dpkg returned an error code (1)

Exception from log:

daz@daz:~/agility/collector/ddl$ cat /var/log/rabbitmq/startup_*

Crash dump was written to: erl_crash.dump
Kernel pid terminated (application_controller) ({application_start_failure,rabbit,{bad_return,{{rabbit,start,[normal,[]]},{'EXIT',{rabbit,failure_during_boot}}}}})
Activating RabbitMQ plugins ...
0 plugins activated:

+---+ +---+
| | | |
| | | |
| | | |
| +---+ +-------+
| |
| RabbitMQ +---+ |
| | | |
| v2.8.4 +---+ |
| |
+-------------------+
AMQP 0-9-1 / 0-9 / 0-8
Copyright (C) 2007-2012 VMware, Inc.
Licensed under the MPL. See http://www.rabbitmq.com/

node : rabbit@daz
app descriptor : /usr/lib/rabbitmq/lib/rabbitmq_server-2.8.4/sbin/../ebin/rabbit.app
home dir : /var/lib/rabbitmq
config file(s) : (none)
cookie hash : HhvK5geb3Nq/ypNKRomYig==
log : /<email address hidden>
sasl log : /<email address hidden>
database dir : /var/lib/rabbitmq/mnesia/rabbit@daz
erlang version : 5.9.1

-- rabbit boot start
starting file handle cache server ...done
starting worker pool ...done
starting database ...done
starting database sync ...done
starting codec correctness check ...done
-- external infrastructure ready
starting plugin registry ...

Read more...

To post a comment you must log in.
This report contains Public information  Edit
Everyone can see this information.

Other bug subscribers