pygobject ftbfs in 18.04 LTS

Bug #1813591 reported by Matthias Klose on 2019-01-28
10
This bug affects 1 person
Affects Status Importance Assigned to Milestone
pygobject (Ubuntu)
High
Unassigned
Bionic
High
Jeremy Bicha

Bug Description

Impact
------
pygobject doesn't build from source which means someone would need to fix that problem before fixing any bugs in the pygobject package for Ubuntu 18.04 LTS.

Test Case
---------
Does pygobject build successfully?

Regression Potential
--------------------
pygobject 3.28 is the intended version to match glib 2.56 but it missed the deadline for Ubuntu 18.04 LTS. So this fix is cherry-picking a small commit to fix the build tests with 18.04's glib2.0 2.56.

The only change that is made in this upload is to the tests. There should be no effect on anything else.

https://gitlab.gnome.org/GNOME/pygobject/commit/550bd7c7

Original Bug Report
-------------------
according to
http://people.canonical.com/~doko/ftbfs-report/test-rebuild-20181222-bionic.html

pygobject ftbfs.

======================================================================
FAIL: test_filenames (test_glib.TestGLib)
----------------------------------------------------------------------
Traceback (most recent call last):
  File "/<<PKGBUILDDIR>>/tests/test_glib.py", line 66, in test_filenames
    self.assertTrue(isinstance(res, bytes))
AssertionError: False is not true

----------------------------------------------------------------------
Ran 1211 tests in 4.072s

FAILED (failures=1, skipped=4, expected failures=12)

 torture test 1 (10000 iterations): 0.012186 secs
 torture test 2 (10000 iterations): 0.068459 secs
 torture test 3 (10000 iterations): 0.029216 secs
 torture test 4 (10000 iterations): 0.065890 secs
 ====
 Total: 0.175751 sec
Makefile:905: recipe for target 'check.real' failed
make[5]: *** [check.real] Error 1
make[5]: Leaving directory '/<<PKGBUILDDIR>>/build-3.6/tests'
Makefile:900: recipe for target 'check-local' failed
make[4]: *** [check-local] Error 2
Makefile:738: recipe for target 'check-am' failed
make[3]: *** [check-am] Error 2
Makefile:691: recipe for target 'check-recursive' failed
make[2]: *** [check-recursive] Error 1

Matthias Klose (doko) on 2019-01-28
Changed in pygobject (Ubuntu):
importance: Undecided → High
Changed in pygobject (Ubuntu Bionic):
importance: Undecided → High
tags: added: ftbfs rls-bb-incoming
Jeremy Bicha (jbicha) on 2019-01-29
Changed in pygobject (Ubuntu Bionic):
assignee: nobody → Jeremy Bicha (jbicha)
Changed in pygobject (Ubuntu):
status: New → Fix Released
Changed in pygobject (Ubuntu Bionic):
status: New → Triaged
Jeremy Bicha (jbicha) on 2019-01-29
description: updated
Jeremy Bicha (jbicha) on 2019-01-29
Changed in pygobject (Ubuntu Bionic):
status: Triaged → In Progress
Jeremy Bicha (jbicha) on 2019-01-29
tags: added: bionic
removed: rls-bb-incoming

Hello Matthias, or anyone else affected,

Accepted pygobject into bionic-proposed. The package will build now and be available at https://launchpad.net/ubuntu/+source/pygobject/3.26.1-2ubuntu1 in a few hours, and then in the -proposed repository.

Please help us by testing this new package. See https://wiki.ubuntu.com/Testing/EnableProposed for documentation on how to enable and use -proposed. Your feedback will aid us getting this update out to other Ubuntu users.

If this package fixes the bug for you, please add a comment to this bug, mentioning the version of the package you tested and change the tag from verification-needed-bionic to verification-done-bionic. If it does not fix the bug for you, please add a comment stating that, and change the tag to verification-failed-bionic. In either case, without details of your testing we will not be able to proceed.

Further information regarding the verification process can be found at https://wiki.ubuntu.com/QATeam/PerformingSRUVerification . Thank you in advance for helping!

N.B. The updated package will be released to -updates after the bug(s) fixed by this package have been verified and the package has been in -proposed for a minimum of 7 days.

Changed in pygobject (Ubuntu Bionic):
status: In Progress → Fix Committed
tags: added: verification-needed verification-needed-bionic
To post a comment you must log in.
This report contains Public information  Edit
Everyone can see this information.

Other bug subscribers