Comment 0 for bug 1823429

https://launchpadlibrarian.net/417924791/buildlog_ubuntu-disco-amd64.linux-oracle_4.15.0-1010.12_BUILDING.txt.gz

  HOSTLD scripts/mod/modpost
  HOSTCC scripts/selinux/genheaders/genheaders
In file included from /<<PKGBUILDDIR>>/scripts/selinux/genheaders/genheaders.c:19:
/<<PKGBUILDDIR>>/security/selinux/include/classmap.h:247:2: error: #error New address family defined, please update secclass_map.
 #error New address family defined, please update secclass_map.
  ^~~~~
make[6]: *** [scripts/Makefile.host:90: scripts/selinux/genheaders/genheaders] Error 1
make[5]: *** [/<<PKGBUILDDIR>>/scripts/Makefile.build:606: scripts/selinux/genheaders] Error 2
make[4]: *** [/<<PKGBUILDDIR>>/scripts/Makefile.build:606: scripts/selinux] Error 2
make[3]: *** [/<<PKGBUILDDIR>>/Makefile:589: scripts] Error 2
make[2]: *** [/<<PKGBUILDDIR>>/Makefile:278: __build_one_by_one] Error 2
make[2]: Leaving directory '/<<PKGBUILDDIR>>/debian/build/build-oracle'
make[1]: *** [Makefile:146: sub-make] Error 2
make[1]: Leaving directory '/<<PKGBUILDDIR>>'