Comment 9 for bug 730860

Andy Whitcroft (apw) wrote :

The kernel seems to being affected also. Seems to affect at least amd64 and powerpc builds; i386 seems to be unaffected. amd64 build reported as below:

/build/buildd/linux-2.6.38/drivers/isdn/gigaset/isocdata.c: In function 'gigaset_isoc_buildframe':
/build/buildd/linux-2.6.38/drivers/isdn/gigaset/isocdata.c:496:1: internal compiler error: in dwarf2out_frame_debug_adjust_cfa, at dwarf2out.c:1861
Please submit a full bug report,
with preprocessed source if appropriate.
See <file:///usr/share/doc/gcc-4.5/README.Bugs> for instructions.
{standard input}: Assembler messages:
{standard input}:1376: Error: open CFI at the end of file; missing .cfi_endproc directive
make[5]: *** [drivers/isdn/gigaset/isocdata.o] Error 1
make[4]: *** [drivers/isdn/gigaset] Error 2
make[3]: *** [drivers/isdn] Error 2
make[2]: *** [drivers] Error 2
make[2]: *** Waiting for unfinished jobs....