Comment 3 for bug 1569434

Rik Mills (rikmills) wrote :

Just ran into this.

autopkgtest kde-runtime_16.12.1-0ubuntu1.dsc -- qemu autopkgtest-zesty-amd64.img

fails with

dh_builddeb -u-Zxz
dpkg-deb: building package 'kde-runtime' in '../kde-runtime_16.12.1-0ubuntu1_amd64.deb'.
dpkg-deb: building package 'kdebase-runtime' in '../kdebase-runtime_16.12.1-0ubuntu1_all.deb'.
dpkg-deb: building package 'kde-runtime-data' in '../kde-runtime-data_16.12.1-0ubuntu1_all.deb'.
dpkg-deb: building package 'plasma-scriptengine-javascript' in '../plasma-scriptengine-javascript_16.12.1-0ubuntu1_amd64.deb'.
=== Start list-missing
=== End list-missing
dpkg-genchanges > ../.pkg-kde-lintian.changes
dpkg-genchanges: error: cannot read ../kde-runtime_16.12.1-0ubuntu1.dsc: No such file or directory
/usr/share/pkg-kde-tools/qt-kde-team/2/lintian.mk:20: recipe for target 'lintian' failed
make[1]: *** [lintian] Error 2
make[1]: Leaving directory '/tmp/autopkgtest.RcZr7G/build.KDu/kde-runtime-16.12.1'
/usr/share/pkg-kde-tools/qt-kde-team/2/dhmk.mk:110: recipe for target 'debian/dhmk_binary' failed
make: *** [debian/dhmk_binary] Error 2
dpkg-buildpackage: error: fakeroot debian/rules binary gave error exit status 2
blame: kde-runtime_16.12.1-0ubuntu1.dsc
badpkg: rules build failed with exit code 2
autopkgtest [00:03:13]: ERROR: erroneous package: rules build failed with exit code 2
qemu-system-x86_64: terminating on signal 15 from pid 15060