Comment 1 for bug 1308280

I'm seeing build failures :-(

/ubuntu-filemanager-app/src/plugin/folderlistmodel/dirmodel.cpp:43:41: fatal error: taglib/attachedpictureframe.h: No such file or directory
 #include <taglib/attachedpictureframe.h>
                                         ^
compilation terminated.
make[2]: *** [src/plugin/folderlistmodel/CMakeFiles/folderlistmodel.dir/dirmodel.cpp.o] Error 1
make[1]: *** [src/plugin/folderlistmodel/CMakeFiles/folderlistmodel.dir/all] Error 2
make: *** [all] Error 2
Usage: click build [options] DIRECTORY

You don't have to use phablet-test-setup, so I'm curious if the tests run or not.