Unit test failures: Datastore version 'b00000b0-00b0-0b00-00b0-000b000000bb' cannot be found.

Bug #1302784 reported by Thomas Goirand on 2014-04-04
14
This bug affects 3 people
Affects Status Importance Assigned to Milestone
OpenStack DBaaS (Trove)
High
Denis M.

Bug Description

When building Trove Icehouse RC1, I have the below unit test failures. I'd be nice to have this fixed before the official release date.

======================================================================
FAIL: instance.test_instance_status.InstanceStatusTest.test_nova_server_build_reports_build
instance.test_instance_status.InstanceStatusTest.test_nova_server_build_reports_build
----------------------------------------------------------------------
_StringException: Traceback (most recent call last):
  File "/tmp/buildd/openstack-trove-2014.1~rc1/trove/tests/unittests/instance/test_instance_status.py", line 88, in test_nova_server_build_reports_build
    instance = SimpleInstance('dummy context', fake_db_info, fake_status)
  File "trove/instance/models.py", line 164, in __init__
    load_by_uuid(self.db_info.datastore_version_id))
  File "trove/datastore/models.py", line 120, in load_by_uuid
    raise exception.DatastoreVersionNotFound(version=uuid)
DatastoreVersionNotFound: Datastore version 'b00000b0-00b0-0b00-00b0-000b000000bb' cannot be found.

======================================================================
FAIL: instance.test_instance_status.InstanceStatusTest.test_nova_server_error_reports_error
instance.test_instance_status.InstanceStatusTest.test_nova_server_error_reports_error
----------------------------------------------------------------------
_StringException: Traceback (most recent call last):
  File "/tmp/buildd/openstack-trove-2014.1~rc1/trove/tests/unittests/instance/test_instance_status.py", line 95, in test_nova_server_error_reports_error
    instance = SimpleInstance('dummy context', fake_db_info, fake_status)
  File "trove/instance/models.py", line 164, in __init__
    load_by_uuid(self.db_info.datastore_version_id))
  File "trove/datastore/models.py", line 120, in load_by_uuid
    raise exception.DatastoreVersionNotFound(version=uuid)
DatastoreVersionNotFound: Datastore version 'b00000b0-00b0-0b00-00b0-000b000000bb' cannot be found.

======================================================================
FAIL: instance.test_instance_status.InstanceStatusTest.test_nova_server_reboot_reports_reboot
instance.test_instance_status.InstanceStatusTest.test_nova_server_reboot_reports_reboot
----------------------------------------------------------------------
_StringException: Traceback (most recent call last):
  File "/tmp/buildd/openstack-trove-2014.1~rc1/trove/tests/unittests/instance/test_instance_status.py", line 102, in test_nova_server_reboot_reports_reboot
    instance = SimpleInstance('dummy context', fake_db_info, fake_status)
  File "trove/instance/models.py", line 164, in __init__
    load_by_uuid(self.db_info.datastore_version_id))
  File "trove/datastore/models.py", line 120, in load_by_uuid
    raise exception.DatastoreVersionNotFound(version=uuid)
DatastoreVersionNotFound: Datastore version 'b00000b0-00b0-0b00-00b0-000b000000bb' cannot be found.

======================================================================
FAIL: instance.test_instance_status.InstanceStatusTest.test_nova_server_resize_reports_resize
instance.test_instance_status.InstanceStatusTest.test_nova_server_resize_reports_resize
----------------------------------------------------------------------
_StringException: Traceback (most recent call last):
  File "/tmp/buildd/openstack-trove-2014.1~rc1/trove/tests/unittests/instance/test_instance_status.py", line 109, in test_nova_server_resize_reports_resize
    instance = SimpleInstance('dummy context', fake_db_info, fake_status)
  File "trove/instance/models.py", line 164, in __init__
    load_by_uuid(self.db_info.datastore_version_id))
  File "trove/datastore/models.py", line 120, in load_by_uuid
    raise exception.DatastoreVersionNotFound(version=uuid)
DatastoreVersionNotFound: Datastore version 'b00000b0-00b0-0b00-00b0-000b000000bb' cannot be found.

======================================================================
FAIL: instance.test_instance_status.InstanceStatusTest.test_nova_server_verify_resize_reports_resize
instance.test_instance_status.InstanceStatusTest.test_nova_server_verify_resize_reports_resize
----------------------------------------------------------------------
_StringException: Traceback (most recent call last):
  File "/tmp/buildd/openstack-trove-2014.1~rc1/trove/tests/unittests/instance/test_instance_status.py", line 116, in test_nova_server_verify_resize_reports_resize
    instance = SimpleInstance('dummy context', fake_db_info, fake_status)
  File "trove/instance/models.py", line 164, in __init__
    load_by_uuid(self.db_info.datastore_version_id))
  File "trove/datastore/models.py", line 120, in load_by_uuid
    raise exception.DatastoreVersionNotFound(version=uuid)
DatastoreVersionNotFound: Datastore version 'b00000b0-00b0-0b00-00b0-000b000000bb' cannot be found.

======================================================================
FAIL: instance.test_instance_status.InstanceStatusTest.test_service_status_new_reports_build
instance.test_instance_status.InstanceStatusTest.test_service_status_new_reports_build
----------------------------------------------------------------------
_StringException: Traceback (most recent call last):
  File "/tmp/buildd/openstack-trove-2014.1~rc1/trove/tests/unittests/instance/test_instance_status.py", line 130, in test_service_status_new_reports_build
    instance = SimpleInstance('dummy context', fake_db_info, fake_status)
  File "trove/instance/models.py", line 164, in __init__
    load_by_uuid(self.db_info.datastore_version_id))
  File "trove/datastore/models.py", line 120, in load_by_uuid
    raise exception.DatastoreVersionNotFound(version=uuid)
DatastoreVersionNotFound: Datastore version 'b00000b0-00b0-0b00-00b0-000b000000bb' cannot be found.

======================================================================
FAIL: instance.test_instance_status.InstanceStatusTest.test_service_status_paused_reports_reboot
instance.test_instance_status.InstanceStatusTest.test_service_status_paused_reports_reboot
----------------------------------------------------------------------
_StringException: Traceback (most recent call last):
  File "/tmp/buildd/openstack-trove-2014.1~rc1/trove/tests/unittests/instance/test_instance_status.py", line 123, in test_service_status_paused_reports_reboot
    instance = SimpleInstance('dummy context', fake_db_info, fake_status)
  File "trove/instance/models.py", line 164, in __init__
    load_by_uuid(self.db_info.datastore_version_id))
  File "trove/datastore/models.py", line 120, in load_by_uuid
    raise exception.DatastoreVersionNotFound(version=uuid)
DatastoreVersionNotFound: Datastore version 'b00000b0-00b0-0b00-00b0-000b000000bb' cannot be found.

======================================================================
FAIL: instance.test_instance_status.InstanceStatusTest.test_service_status_running_reports_active
instance.test_instance_status.InstanceStatusTest.test_service_status_running_reports_active
----------------------------------------------------------------------
_StringException: Traceback (most recent call last):
  File "/tmp/buildd/openstack-trove-2014.1~rc1/trove/tests/unittests/instance/test_instance_status.py", line 137, in test_service_status_running_reports_active
    instance = SimpleInstance('dummy context', fake_db_info, fake_status)
  File "trove/instance/models.py", line 164, in __init__
    load_by_uuid(self.db_info.datastore_version_id))
  File "trove/datastore/models.py", line 120, in load_by_uuid
    raise exception.DatastoreVersionNotFound(version=uuid)
DatastoreVersionNotFound: Datastore version 'b00000b0-00b0-0b00-00b0-000b000000bb' cannot be found.

======================================================================
FAIL: instance.test_instance_status.InstanceStatusTest.test_task_status_action_building_reports_build
instance.test_instance_status.InstanceStatusTest.test_task_status_action_building_reports_build
----------------------------------------------------------------------
_StringException: Traceback (most recent call last):
  File "/tmp/buildd/openstack-trove-2014.1~rc1/trove/tests/unittests/instance/test_instance_status.py", line 60, in test_task_status_action_building_reports_build
    instance = SimpleInstance('dummy context', fake_db_info, fake_status)
  File "trove/instance/models.py", line 164, in __init__
    load_by_uuid(self.db_info.datastore_version_id))
  File "trove/datastore/models.py", line 120, in load_by_uuid
    raise exception.DatastoreVersionNotFound(version=uuid)
DatastoreVersionNotFound: Datastore version 'b00000b0-00b0-0b00-00b0-000b000000bb' cannot be found.

======================================================================
FAIL: instance.test_instance_status.InstanceStatusTest.test_task_status_action_deleting_reports_shutdown
instance.test_instance_status.InstanceStatusTest.test_task_status_action_deleting_reports_shutdown
----------------------------------------------------------------------
_StringException: Traceback (most recent call last):
  File "/tmp/buildd/openstack-trove-2014.1~rc1/trove/tests/unittests/instance/test_instance_status.py", line 81, in test_task_status_action_deleting_reports_shutdown
    instance = SimpleInstance('dummy context', fake_db_info, fake_status)
  File "trove/instance/models.py", line 164, in __init__
    load_by_uuid(self.db_info.datastore_version_id))
  File "trove/datastore/models.py", line 120, in load_by_uuid
    raise exception.DatastoreVersionNotFound(version=uuid)
DatastoreVersionNotFound: Datastore version 'b00000b0-00b0-0b00-00b0-000b000000bb' cannot be found.

======================================================================
FAIL: instance.test_instance_status.InstanceStatusTest.test_task_status_action_rebooting_reports_reboot
instance.test_instance_status.InstanceStatusTest.test_task_status_action_rebooting_reports_reboot
----------------------------------------------------------------------
_StringException: Traceback (most recent call last):
  File "/tmp/buildd/openstack-trove-2014.1~rc1/trove/tests/unittests/instance/test_instance_status.py", line 67, in test_task_status_action_rebooting_reports_reboot
    instance = SimpleInstance('dummy context', fake_db_info, fake_status)
  File "trove/instance/models.py", line 164, in __init__
    load_by_uuid(self.db_info.datastore_version_id))
  File "trove/datastore/models.py", line 120, in load_by_uuid
    raise exception.DatastoreVersionNotFound(version=uuid)
DatastoreVersionNotFound: Datastore version 'b00000b0-00b0-0b00-00b0-000b000000bb' cannot be found.

======================================================================
FAIL: instance.test_instance_status.InstanceStatusTest.test_task_status_action_resizing_reports_resize
instance.test_instance_status.InstanceStatusTest.test_task_status_action_resizing_reports_resize
----------------------------------------------------------------------
_StringException: Traceback (most recent call last):
  File "/tmp/buildd/openstack-trove-2014.1~rc1/trove/tests/unittests/instance/test_instance_status.py", line 74, in test_task_status_action_resizing_reports_resize
    instance = SimpleInstance('dummy context', fake_db_info, fake_status)
  File "trove/instance/models.py", line 164, in __init__
    load_by_uuid(self.db_info.datastore_version_id))
  File "trove/datastore/models.py", line 120, in load_by_uuid
    raise exception.DatastoreVersionNotFound(version=uuid)
DatastoreVersionNotFound: Datastore version 'b00000b0-00b0-0b00-00b0-000b000000bb' cannot be found.

======================================================================
FAIL: instance.test_instance_status.InstanceStatusTest.test_task_status_error_reports_error
instance.test_instance_status.InstanceStatusTest.test_task_status_error_reports_error
----------------------------------------------------------------------
_StringException: Traceback (most recent call last):
  File "/tmp/buildd/openstack-trove-2014.1~rc1/trove/tests/unittests/instance/test_instance_status.py", line 53, in test_task_status_error_reports_error
    instance = SimpleInstance('dummy context', fake_db_info, fake_status)
  File "trove/instance/models.py", line 164, in __init__
    load_by_uuid(self.db_info.datastore_version_id))
  File "trove/datastore/models.py", line 120, in load_by_uuid
    raise exception.DatastoreVersionNotFound(version=uuid)
DatastoreVersionNotFound: Datastore version 'b00000b0-00b0-0b00-00b0-000b000000bb' cannot be found.

======================================================================
FAIL: mgmt.test_models.TestMgmtInstanceTasks.test_public_exists_events
mgmt.test_models.TestMgmtInstanceTasks.test_public_exists_events
----------------------------------------------------------------------
_StringException: Traceback (most recent call last):
  File "/tmp/buildd/openstack-trove-2014.1~rc1/trove/tests/unittests/mgmt/test_models.py", line 367, in test_public_exists_events
    None)
  File "trove/extensions/mgmt/instances/models.py", line 70, in __init__
    datastore_status)
  File "trove/instance/models.py", line 495, in __init__
    super(BaseInstance, self).__init__(context, db_info, datastore_status)
  File "trove/instance/models.py", line 164, in __init__
    load_by_uuid(self.db_info.datastore_version_id))
  File "trove/datastore/models.py", line 120, in load_by_uuid
    raise exception.DatastoreVersionNotFound(version=uuid)
DatastoreVersionNotFound: Datastore version 'b00000b0-00b0-0b00-00b0-000b000000bb' cannot be found.

======================================================================
FAIL: mgmt.test_models.TestNovaNotificationTransformer.test_tranformer
mgmt.test_models.TestNovaNotificationTransformer.test_tranformer
----------------------------------------------------------------------
_StringException: Traceback (most recent call last):
  File "/tmp/buildd/openstack-trove-2014.1~rc1/trove/tests/unittests/mgmt/test_models.py", line 180, in test_tranformer
    None)
  File "trove/extensions/mgmt/instances/models.py", line 70, in __init__
    datastore_status)
  File "trove/instance/models.py", line 495, in __init__
    super(BaseInstance, self).__init__(context, db_info, datastore_status)
  File "trove/instance/models.py", line 164, in __init__
    load_by_uuid(self.db_info.datastore_version_id))
  File "trove/datastore/models.py", line 120, in load_by_uuid
    raise exception.DatastoreVersionNotFound(version=uuid)
DatastoreVersionNotFound: Datastore version 'b00000b0-00b0-0b00-00b0-000b000000bb' cannot be found.

======================================================================
FAIL: mgmt.test_models.TestNovaNotificationTransformer.test_tranformer_flavor_cache
mgmt.test_models.TestNovaNotificationTransformer.test_tranformer_flavor_cache
----------------------------------------------------------------------
_StringException: Traceback (most recent call last):
  File "/tmp/buildd/openstack-trove-2014.1~rc1/trove/tests/unittests/mgmt/test_models.py", line 329, in test_tranformer_flavor_cache
    None)
  File "trove/extensions/mgmt/instances/models.py", line 70, in __init__
    datastore_status)
  File "trove/instance/models.py", line 495, in __init__
    super(BaseInstance, self).__init__(context, db_info, datastore_status)
  File "trove/instance/models.py", line 164, in __init__
    load_by_uuid(self.db_info.datastore_version_id))
  File "trove/datastore/models.py", line 120, in load_by_uuid
    raise exception.DatastoreVersionNotFound(version=uuid)
DatastoreVersionNotFound: Datastore version 'b00000b0-00b0-0b00-00b0-000b000000bb' cannot be found.

======================================================================
FAIL: mgmt.test_models.TestNovaNotificationTransformer.test_tranformer_no_nova_instance
mgmt.test_models.TestNovaNotificationTransformer.test_tranformer_no_nova_instance
----------------------------------------------------------------------
_StringException: Traceback (most recent call last):
  File "/tmp/buildd/openstack-trove-2014.1~rc1/trove/tests/unittests/mgmt/test_models.py", line 302, in test_tranformer_no_nova_instance
    None)
  File "trove/extensions/mgmt/instances/models.py", line 70, in __init__
    datastore_status)
  File "trove/instance/models.py", line 495, in __init__
    super(BaseInstance, self).__init__(context, db_info, datastore_status)
  File "trove/instance/models.py", line 164, in __init__
    load_by_uuid(self.db_info.datastore_version_id))
  File "trove/datastore/models.py", line 120, in load_by_uuid
    raise exception.DatastoreVersionNotFound(version=uuid)
DatastoreVersionNotFound: Datastore version 'b00000b0-00b0-0b00-00b0-000b000000bb' cannot be found.

======================================================================
FAIL: mgmt.test_models.TestNovaNotificationTransformer.test_tranformer_shutdown_instance
mgmt.test_models.TestNovaNotificationTransformer.test_tranformer_shutdown_instance
----------------------------------------------------------------------
_StringException: Traceback (most recent call last):
  File "/tmp/buildd/openstack-trove-2014.1~rc1/trove/tests/unittests/mgmt/test_models.py", line 278, in test_tranformer_shutdown_instance
    None)
  File "trove/extensions/mgmt/instances/models.py", line 70, in __init__
    datastore_status)
  File "trove/instance/models.py", line 495, in __init__
    super(BaseInstance, self).__init__(context, db_info, datastore_status)
  File "trove/instance/models.py", line 164, in __init__
    load_by_uuid(self.db_info.datastore_version_id))
  File "trove/datastore/models.py", line 120, in load_by_uuid
    raise exception.DatastoreVersionNotFound(version=uuid)
DatastoreVersionNotFound: Datastore version 'b00000b0-00b0-0b00-00b0-000b000000bb' cannot be found.

Thomas Goirand (thomas-goirand) wrote :

If this wasn't clear, I have this problem in all the environments I create packages on: my laptop, Wheezy (with backports), Precise and Sid. I haven't uploaded Trove RC1 to Debian because of the above issues.

Changed in trove:
importance: Undecided → High
status: New → Triaged
Nikhil Manchanda (slicknik) wrote :

Hi Thomas:

Looks like the unit tests are running fine in the OpenStack CI gate. Can I ask how you are installing trove RC1, and how you are running the unittests?

Thanks for your help trying to figure this out.

Thomas Goirand (thomas-goirand) wrote :

Hi,

I'm not running tests in the gate, I'm running them when building the Debian package. You can try using Debian Sid, or using the Wheezy backport repository (see the official install-guide if you need to know how). This is, not using a virtual env, but just using the packaged build-dependencies, and building the package with git-buildpackage (but using dpkg-buildpackage with the source package in Debian is also fine).

Also, note that this happened also with the 2014.1 release, not only with the RC1. If you need, just chat with me on IRC (my nick name is zigo).

Thanks for taking care of this issue,

Thomas

Greg Lucas (glucas-q) wrote :

I'm getting this as well, at least some of the time. I haven't seen it running tox / testr, but do see it just running nostests -- not sure why.

======================================================================
ERROR: trove.tests.unittests.mgmt.test_models.TestNovaNotificationTransformer.test_tranformer_shutdown_instance
----------------------------------------------------------------------
_StringException: Traceback (most recent call last):
  File "/opt/stack/trove/trove/tests/unittests/mgmt/test_models.py", line 278, in test_tranformer_shutdown_instance
    None)
  File "/opt/stack/trove/trove/extensions/mgmt/instances/models.py", line 70, in __init__
    datastore_status)
  File "/opt/stack/trove/trove/instance/models.py", line 499, in __init__
    super(BaseInstance, self).__init__(context, db_info, datastore_status)
  File "/opt/stack/trove/trove/instance/models.py", line 160, in __init__
    load_by_uuid(self.db_info.datastore_version_id))
  File "/opt/stack/trove/trove/datastore/models.py", line 399, in load_by_uuid
    raise exception.DatastoreVersionNotFound(version=uuid)
DatastoreVersionNotFound: Datastore version 'b00000b0-00b0-0b00-00b0-000b000000bb' cannot be found.

Greg Lucas (glucas-q) wrote :

Ahh, I see why. That datastore is created as part of initializing fake mode in trove-integration.

If you run the tests without having done that setup then it will fail this way.

Changed in trove:
assignee: nobody → Greg Lucas (glucas-q)
Thomas Goirand (thomas-goirand) wrote :

Hi. Can you tell how to do this initialization ? I don't mind adding it manually in my Debian package, if at least there's some hints on how to do it somewhere...

Denis M. (dmakogon) wrote :

Greg, if you still working on it, feel free to re-assign it to you again. I'm assigning to myself, will propose the fix asap.

Tomas(zigo) used to launch tests: python setup.py testr --slowest --testr-args='--subunit

Changed in trove:
assignee: Greg Lucas (glucas-q) → Denis M. (dmakogon)
Denis M. (dmakogon) wrote :

Test are failing due to missing datastore version (as can be seen at stack traces). It happens because of required datastore get created only if tests are launched only through run_tests.py:

https://github.com/openstack/trove/blob/master/run_tests.py#L78-L104

For those tests that are depending on 'b00000b0-00b0-0b00-00b0-000b000000bb' datastore version should share, at least, common test case that comes with initializated datsatore and its version.

Denis M. (dmakogon) wrote :
Download full text (15.8 KiB)

I was able to reproduce this issue.
Fresh new paste:
======================================================================
FAIL: instance.test_instance_status.InstanceStatusTest.test_nova_server_error_reports_error
tags: worker-0
----------------------------------------------------------------------
Traceback (most recent call last):
  File "/home/dmakogon/Documents/Trove/repo/debia_build/trove/tests/unittests/instance/test_instance_status.py", line 95, in test_nova_server_error_reports_error
    instance = SimpleInstance('dummy context', fake_db_info, fake_status)
  File "trove/instance/models.py", line 159, in __init__
    load_by_uuid(self.db_info.datastore_version_id))
  File "trove/datastore/models.py", line 399, in load_by_uuid
    raise exception.DatastoreVersionNotFound(version=uuid)
DatastoreVersionNotFound: Datastore version 'b00000b0-00b0-0b00-00b0-000b000000bb' cannot be found.
======================================================================
FAIL: instance.test_instance_status.InstanceStatusTest.test_nova_server_resize_reports_resize
tags: worker-0
----------------------------------------------------------------------
Traceback (most recent call last):
  File "/home/dmakogon/Documents/Trove/repo/debia_build/trove/tests/unittests/instance/test_instance_status.py", line 109, in test_nova_server_resize_reports_resize
    instance = SimpleInstance('dummy context', fake_db_info, fake_status)
  File "trove/instance/models.py", line 159, in __init__
    load_by_uuid(self.db_info.datastore_version_id))
  File "trove/datastore/models.py", line 399, in load_by_uuid
    raise exception.DatastoreVersionNotFound(version=uuid)
DatastoreVersionNotFound: Datastore version 'b00000b0-00b0-0b00-00b0-000b000000bb' cannot be found.
======================================================================
FAIL: instance.test_instance_status.InstanceStatusTest.test_service_status_running_reports_active
tags: worker-0
----------------------------------------------------------------------
Traceback (most recent call last):
  File "/home/dmakogon/Documents/Trove/repo/debia_build/trove/tests/unittests/instance/test_instance_status.py", line 137, in test_service_status_running_reports_active
    instance = SimpleInstance('dummy context', fake_db_info, fake_status)
  File "trove/instance/models.py", line 159, in __init__
    load_by_uuid(self.db_info.datastore_version_id))
  File "trove/datastore/models.py", line 399, in load_by_uuid
    raise exception.DatastoreVersionNotFound(version=uuid)
DatastoreVersionNotFound: Datastore version 'b00000b0-00b0-0b00-00b0-000b000000bb' cannot be found.
======================================================================
FAIL: mgmt.test_models.TestMgmtInstanceTasks.test_public_exists_events
tags: worker-0
----------------------------------------------------------------------
Traceback (most recent call last):
  File "/home/dmakogon/Documents/Trove/repo/debia_build/trove/tests/unittests/mgmt/test_models.py", line 367, in test_public_exists_events
    None)
  File "trove/extensions/mgmt/instances/models.py", line 74, in __init__
    datastore_status)
  File "trove/instance/models.py", line 534, in __init__
    super(Ba...

Fix proposed to branch: master
Review: https://review.openstack.org/123450

Changed in trove:
status: Triaged → In Progress

Reviewed: https://review.openstack.org/123450
Committed: https://git.openstack.org/cgit/openstack/trove/commit/?id=2de5c0f66d938a320bb79093180bef3fb5983b4a
Submitter: Jenkins
Branch: master

commit 2de5c0f66d938a320bb79093180bef3fb5983b4a
Author: Denis M <email address hidden>
Date: Thu Sep 25 00:07:05 2014 +0300

    Isolate unit tests from integration tests data

    Reasons:
     - unit tests are depending on integration tests data, such as:
      - datastore and its versions;
     - distribution package maintainers are not able to package Trove since ice house RC1.

    Gate behaviour:
     - gate tests are not failing because unit tests are running right after
       fake-mode tests, so sqlite still exist.

    Changes:
     - fixing those unit tests that are failing while building Trove package
       (more info see at bug-report).

    Change-Id: Ib9a41d68481d32cdd81fc4d7c015a63c4da33bb3
    Closes-Bug: #1302784

Changed in trove:
status: In Progress → Fix Committed
Thierry Carrez (ttx) on 2014-10-03
Changed in trove:
milestone: none → juno-rc1
status: Fix Committed → Fix Released
Thierry Carrez (ttx) on 2014-10-16
Changed in trove:
milestone: juno-rc1 → 2014.2

Change abandoned by Denis M. (<email address hidden>) on branch: stable/icehouse
Review: https://review.openstack.org/125093

To post a comment you must log in.
This report contains Public information  Edit
Everyone can see this information.

Other bug subscribers