Comment 8 for bug 1156664

Patrick Storz (ede123) wrote :

This actually broke building on Windows completely (see below). Please fix ASAP!

    cc : compile src/trace/potrace/decompose.cpp (src/trace/potrace/bitmap.h modified)
Make error line 307: problem compiling: mingw32-g++: error: src/trace/potrace/decompose.cpp: No such file or directory
mingw32-g++: fatal error: no input files
compilation terminated.

compile src/trace/potrace/inkscape-potrace.cpp
Make error line 307: problem compiling: In file included from src/trace/potrace/inkscape-potrace.cpp:17:0:
src/trace/potrace/inkscape-potrace.h:21:24: fatal error: potracelib.h: No such file or directory
compilation terminated.

    cc : compile src/trace/trace.cpp (src/document.h modified)
Make error line 307: problem compiling: In file included from src/trace/trace.cpp:15:0:
src/trace/potrace/inkscape-potrace.h:21:24: fatal error: potracelib.h: No such file or directory
compilation terminated.

    cc : compile src/ui/dialog/tracedialog.cpp (src/trace/potrace/inkscape-potrace.h modified)
Make error line 307: problem compiling: In file included from src/ui/dialog/tracedialog.cpp:33:0:
src/trace/potrace/inkscape-potrace.h:21:24: fatal error: potracelib.h: No such file or directory
compilation terminated.

    cc : compile src/ui/tools/flood-tool.cpp (src/document.h modified)
Make error line 307: problem compiling: In file included from src/ui/tools/flood-tool.cpp:24:0:
src/trace/potrace/inkscape-potrace.h:21:24: fatal error: potracelib.h: No such file or directory
compilation terminated.