upstart tests no longer run unless NIH supports TAP

Bug #1250126 reported by James Hunt on 2013-11-11
6
This bug affects 1 person
Affects Status Importance Assigned to Milestone
upstart
Undecided
Dimitri John Ledkov

Bug Description

$ make check
Making check in test
make[1]: Entering directory `/home/james/tmp/upstart/test'
make libtest_util_common.a test_util_check_env
make[2]: Entering directory `/home/james/tmp/upstart/test'
make[2]: `libtest_util_common.a' is up to date.
make[2]: `test_util_check_env' is up to date.
make[2]: Leaving directory `/home/james/tmp/upstart/test'
make check-TESTS
make[2]: Entering directory `/home/james/tmp/upstart/test'
make[3]: Entering directory `/home/james/tmp/upstart/test'
/bin/bash: line 2: --test-name: command not found
make[3]: *** [test_util_check_env.log] Error 127
make[3]: Leaving directory `/home/james/tmp/upstart/test'
make[2]: *** [check-TESTS] Error 2
make[2]: Leaving directory `/home/james/tmp/upstart/test'
make[1]: *** [check-am] Error 2
make[1]: Leaving directory `/home/james/tmp/upstart/test'
make: *** [check-recursive] Error 1

Related branches

James Hunt (jamesodhunt) on 2013-11-11
Changed in upstart:
assignee: nobody → Dmitrijs Ledkovs (xnox)
Changed in upstart:
status: New → Fix Committed
Changed in upstart:
status: Fix Committed → Fix Released
To post a comment you must log in.
This report contains Public information  Edit
Everyone can see this information.

Other bug subscribers