make launcher fails

Bug #983989 reported by Albert Astals Cid on 2012-04-17
This bug affects 1 person
Affects Status Importance Assigned to Milestone
Fix Released
Andrea Azzarone
unity (Ubuntu)
Andrea Azzarone
Andrea Azzarone

Bug Description

SRU testcase

1. grab unity source
2. cmake
3. run 'make launcher'
4. the build would fail
5. install unity from precise-proposed
6. it will build

make launcher
[ 40%] Built target unity-core-5.0
Scanning dependencies of target launcher
[ 40%] Building CXX object standalone-clients/CMakeFiles/launcher.dir/TestLauncher.cpp.o
In file included from /home/tsdgeos_work/pkgs/unity/unity-5.10.0+bzr2284ubuntu0+695/standalone-clients/TestLauncher.cpp:34:0:
/home/tsdgeos_work/pkgs/unity/unity-5.10.0+bzr2284ubuntu0+695/standalone-clients/../plugins/unityshell/src/LauncherController.h:44:17: error: ‘Options’ was not declared in this scope
/home/tsdgeos_work/pkgs/unity/unity-5.10.0+bzr2284ubuntu0+695/standalone-clients/../plugins/unityshell/src/LauncherController.h:44:29: error: template argument 1 is invalid
make[3]: *** [standalone-clients/CMakeFiles/launcher.dir/TestLauncher.cpp.o] Error 1
make[2]: *** [standalone-clients/CMakeFiles/launcher.dir/all] Error 2
make[1]: *** [standalone-clients/CMakeFiles/launcher.dir/rule] Error 2
make: *** [launcher] Error 2

Related branches

Andrea Azzarone (azzar1) on 2012-04-18
Changed in unity:
status: New → Confirmed
importance: Undecided → Low
assignee: nobody → Andrea Azzarone (andyrock)
status: Confirmed → In Progress
Andrea Azzarone (azzar1) on 2012-04-18
Changed in unity:
status: In Progress → Fix Committed
milestone: none → 5.12.0
Changed in unity (Ubuntu):
status: New → Fix Committed
assignee: nobody → Andrea Azzarone (andyrock)
Changed in unity (Ubuntu):
importance: Undecided → Low
Omer Akram (om26er) on 2012-04-26
description: updated
Didier Roche (didrocks) on 2012-04-27
Changed in unity:
status: Fix Committed → Fix Released

Hello Albert, or anyone else affected,

Accepted unity into precise-proposed. The package will build now and be available in a few hours. Please test and give feedback here. See for documentation how to enable and use -proposed. Thank you in advance!

tags: added: verification-needed
Launchpad Janitor (janitor) wrote :
Download full text (6.0 KiB)

This bug was fixed in the package unity - 5.12-0ubuntu1

unity (5.12-0ubuntu1) precise-proposed; urgency=low

  * New upstream release.
    - Launcher, Alt-Tab - clicking on launcher item or selecting a app in Alt-
      Tab raises all app windows, not just most recently focused (LP: #959339)
    - [heap corruption?] compiz crashed with SIGSEGV in _int_malloc() from
      g_realloc() from ... from g_dbus_connection_send_message_with_reply()
      from g_object_unref() from unity::dash::HomeLens::Impl::~Impl() from
      unity::dash::HomeLens::~HomeLens() (LP: #931201)
    - compiz crashed with SIGSEGV in _int_malloc() from __libc_calloc() from
      XOpenDisplay() from nux::WindowThread::ThreadCtor() (LP: #947844)
    - Regression: Installing apps causes a terrible visual glitch-- have to
      restart (LP: #981168)
    - Window management - unity doesn't realise when applications bring their
      windows to the front (LP: #802816)
    - Dash - Clicking on the desktop dash border should do nothing, *NOT*
      close the dash (LP: #839472)
    - [FFe, UIFe] HUD - The HUD does not respect launcher icon size settings
      in autohide mode (LP: #921506)
    - compiz crashed with SIGSEGV in g_volume_get_mount() (LP: #918548)
    - multiple instances or double icons of application detected on bamfdaemon
      respawn (LP: #928912)
    - Panel is transparent when Dash is open; no blur no average BG color
      (LP: #965323)
    - Unity crashes with SIGSEGV when hitting debug DBus interface hard
      (LP: #979429)
    - compiz crashed with SIGSEGV in _int_malloc() from g_object_unref() from
      unity::dash::Model<unity::dash::FilterAdaptor>::~Model() (LP: #941750)
    - indicators menu are sometimes cut off at screen edge (LP: #883317)
    - the shortcut keys in workspace section of the shortcut overlay aren't
      translated (LP: #980828)
    - [regression] Dash keeps repainting unnecessarily (LP: #980924)
    - compiz crashed with SIGSEGV in nux::NTextureData::ClearData() from
      nux::NTextureData::~NTextureData() from nux::Texture2D::~Texture2D()
      (LP: #952378)
    - compiz crashed with SIGSEGV in g_object_unref() from
      unity::dash::Settings::~Settings() from
      unity::UnityScreen::~UnityScreen() (LP: #981764)
    - compiz crashed with SIGSEGV in unity::dash::ResultView::~ResultView()
      from unity::dash::ResultViewGrid::~ResultViewGrid() from
      nux::Object::Destroy() from nux::Object::UnReference() (LP: #942286)
    - compiz crashed with SIGSEGV in
      ends_with_iter_select<__gnu_cxx::__normal_iterator<char const*,
      std::basic_string<char> >, char const*, boost::algorithm::is_iequal>()
      from unity::ui::PointerBarrierWrapper::EmitCurrentData() (LP: #983268)
    - Chinese can't be shown completely in dash filter (LP: #984583)
    - [Unity 5.10] compiz crashed with SIGSEGV in
      unity::hud::HudIconTextureSource::ColorForIcon() from
      unity::hud::Icon::Icon() from emit from unity::IconTexture::IconLoaded
      (LP: #983646)
    - [regression] Close button does not close the dash/HUD (LP: #986264)
    - compiz crashed with SIGSEGV in g_volume_eject_with_operation_finish()


Changed in unity (Ubuntu):
status: Fix Committed → Fix Released
Changed in unity (Ubuntu Precise):
status: Fix Committed → Fix Released
To post a comment you must log in.
This report contains Public information  Edit
Everyone can see this information.

Other bug subscribers