make check fails on test-unit

Bug #1117487 reported by Andrea Azzarone on 2013-02-06
6
This bug affects 1 person
Affects Status Importance Assigned to Milestone
Unity
Fix Released
High
Andrea Azzarone
unity (Ubuntu)
Undecided
Andrea Azzarone

Bug Description

[ 81%] Built target test-gtest-xless
Linking CXX executable test-gtest
[100%] Built target test-gtest
TEST: ./test-unit... (pid=14049)
  /Unit/PanelService/Allocation:
(test-unit:14049): libindicator-WARNING **: IndicatorObject class does not have an accessible description.
FAIL
GTester: last random seed: R02S3edcf0d9f63aade4d6377e6c1e0a4ac9
(pid=14055)
  /Unit/PanelService/IndicatorLoading:
(test-unit:14055): libindicator-WARNING **: IndicatorObject class does not have an accessible description.
FAIL
GTester: last random seed: R02Sf247959ffb35a9fbf8575a4cb113a268
(pid=14060)
  /Unit/PanelService/EmptyIndicatorObject:
(test-unit:14060): libindicator-WARNING **: IndicatorObject class does not have an accessible description.
FAIL
GTester: last random seed: R02Sc8c969e41d6868d7b6a7e86b166303be
(pid=14065)
  /Unit/PanelService/EntryAddition:
(test-unit:14065): libindicator-WARNING **: IndicatorObject class does not have an accessible description.
FAIL
GTester: last random seed: R02S61f317ad724cd9fdabc971da478a61f0
(pid=14070)
  /Unit/PanelService/EntryActivateRequest:
(test-unit:14070): libindicator-WARNING **: IndicatorObject class does not have an accessible description.
FAIL
GTester: last random seed: R02S70ab0a6180e458c6aa3cc9c076c91fd6
(pid=14075)
  /Unit/StaticCairoText/TextLeftToRightExtentIncreasesWithLength: OK
  /Unit/StaticCairoText/TestRightToLeftExtentIncreasesWithLength:
(test-unit:14075): GLib-CRITICAL **: g_main_loop_quit: assertion `loop != NULL' failed
OK
FAIL: ./test-unit
make[3]: *** [tests/CMakeFiles/check] Error 1
make[2]: *** [tests/CMakeFiles/check.dir/all] Error 2
make[1]: *** [tests/CMakeFiles/check.dir/rule] Error 2
make: *** [check] Error 2

Related branches

Andrea Azzarone (azzar1) on 2013-02-06
Changed in unity:
status: New → In Progress
Changed in unity (Ubuntu):
status: New → In Progress
Changed in unity:
assignee: nobody → Andrea Azzarone (andyrock)
Changed in unity (Ubuntu):
assignee: nobody → Andrea Azzarone (andyrock)
Changed in unity:
milestone: none → 7.0.0
importance: Undecided → Critical
importance: Critical → High
Changed in unity:
status: In Progress → Fix Committed
Andrea Azzarone (azzar1) on 2013-02-06
Changed in unity (Ubuntu):
status: In Progress → Fix Committed
Launchpad Janitor (janitor) wrote :

This bug was fixed in the package unity - 6.12.0daily13.02.07-0ubuntu1

---------------
unity (6.12.0daily13.02.07-0ubuntu1) raring; urgency=low

  [ Andrea Azzarone ]
  * make check fails on test-unit (LP: #1117487)
  * Notification area whitelist is obsolete (LP: #974480)

  [ Marco Trevisan (Treviño) ]
  * Switcher - when opening in detail mode (Alt+`) it should not use the
    spread animation (LP: #1116927)
  * Alt-tab sometimes focuses a window that is not in top of the app
    stack (LP: #1115775)
  * Switcher: Opening and closing the detail mode quickly makes unity
    re-enable it (LP: #1116785)
  * Exiting expo mode leaves the BFB quicklist open (LP: #1090565)

  [ MC Return ]
  * unmaximize_window_key instead of unmaximize_or_minimize_window_key
    exposed in g-c-c (LP: #1115128)

  [ Automatic PS uploader ]
  * Automatic snapshot from revision 3136
 -- Automatic PS uploader <email address hidden> Thu, 07 Feb 2013 06:20:12 +0000

Changed in unity (Ubuntu):
status: Fix Committed → Fix Released
Stephen M. Webb (bregma) on 2013-04-04
Changed in unity:
status: Fix Committed → Fix Released
To post a comment you must log in.
This report contains Public information  Edit
Everyone can see this information.

Other bug subscribers

Related blueprints