Package fails to build with failed import of OpenSSL

Bug #539809 reported by Rick McBride on 2010-03-16
6
This bug affects 1 person
Affects Status Importance Assigned to Milestone
Ubuntu One storage protocol
High
Rick McBride

Bug Description

Got this for revno 90:

dh_testroot
dh_clean
cd . && python setup.py clean -a
Traceback (most recent call last):
  File "setup.py", line 36, in <module>
    from ubuntuone.storageprotocol.context import ssl_cert_location
  File "/build/buildd/ubuntuone-storage-protocol-1.1.3+r90/ubuntuone/storageprotocol/context.py", line 22, in <module>
    from OpenSSL import SSL
ImportError: No module named OpenSSL
make: [python-module-clean/python-ubuntuone-storageprotocol] Error 1 (ignored)
rm -rf debian/python-module-stampdir
find . -name '*.pyc' -exec rm '{}' ';'
find . -prune -name '*.egg-info' -exec rm -rf '{}' ';'
 debian/rules build
test -x debian/rules
mkdir -p "."
mkdir -p debian/python-module-stampdir
cd . && python setup.py build --build-base="/build/buildd/ubuntuone-storage-protocol-1.1.3+r90/./build"
Traceback (most recent call last):
  File "setup.py", line 36, in <module>
    from ubuntuone.storageprotocol.context import ssl_cert_location
  File "/build/buildd/ubuntuone-storage-protocol-1.1.3+r90/ubuntuone/storageprotocol/context.py", line 22, in <module>
    from OpenSSL import SSL
ImportError: No module named OpenSSL
make: *** [debian/python-module-stampdir/python-ubuntuone-storageprotocol] Error 1

Rick McBride (rmcbride) wrote :

Need to track this down. package builder has not changed.

Changed in ubuntuone-storage-protocol:
status: New → Confirmed
importance: Undecided → High
assignee: nobody → Rick McBride (rmcbride)
Rick McBride (rmcbride) on 2010-03-16
summary: - Package failes to build with failed import of OpenSSL
+ Package fails to build with failed import of OpenSSL
dobey (dobey) on 2010-03-16
Changed in ubuntuone-storage-protocol:
status: Confirmed → Fix Committed
Rick McBride (rmcbride) on 2010-03-16
Changed in ubuntuone-storage-protocol:
status: Fix Committed → Fix Released
To post a comment you must log in.
This report contains Public information  Edit
Everyone can see this information.

Other bug subscribers