[nightlies] Test failures during package build

Bug #1186294 reported by dobey on 2013-05-31
6
This bug affects 1 person
Affects Status Importance Assigned to Milestone
Ubuntu One Control Panel
Low
Alejandro J. Cura

Bug Description

The following failures are happening during package builds in nightlies PPA:

===============================================================================
[ERROR]
Traceback (most recent call last):
Failure: twisted.internet.defer.TimeoutError: <ubuntuone.controlpanel.tests.test_web_client.WebClientBuildSignedIriTestCase testMethod=test_correct_query> (test_correct_query) still running at 10.0 secs

ubuntuone.controlpanel.tests.test_web_client.WebClientBuildSignedIriTestCase.test_correct_query
===============================================================================
[ERROR]
Traceback (most recent call last):
Failure: twisted.internet.defer.TimeoutError: <ubuntuone.controlpanel.tests.test_web_client.WebClientBuildSignedIriTestCase testMethod=test_get_url> (test_get_url) still running at 10.0 secs

ubuntuone.controlpanel.tests.test_web_client.WebClientBuildSignedIriTestCase.test_get_url
===============================================================================
[ERROR]
Traceback (most recent call last):
Failure: twisted.internet.defer.TimeoutError: <ubuntuone.controlpanel.tests.test_web_client.WebClientBuildSignedIriTestCase testMethod=test_get_url_error> (test_get_url_error) still running at 10.0 secs

ubuntuone.controlpanel.tests.test_web_client.WebClientBuildSignedIriTestCase.test_get_url_error
===============================================================================
[ERROR]
Traceback (most recent call last):
Failure: twisted.internet.defer.TimeoutError: <ubuntuone.controlpanel.tests.test_web_client.WebClientBuildSignedIriTestCase testMethod=test_is_correct_domain> (test_is_correct_domain) still running at 10.0 secs

ubuntuone.controlpanel.tests.test_web_client.WebClientBuildSignedIriTestCase.test_is_correct_domain
===============================================================================
[ERROR]
Traceback (most recent call last):
Failure: twisted.internet.defer.TimeoutError: <ubuntuone.controlpanel.tests.test_web_client.WebClientBuildSignedIriTestCase testMethod=test_is_correct_path> (test_is_correct_path) still running at 10.0 secs

ubuntuone.controlpanel.tests.test_web_client.WebClientBuildSignedIriTestCase.test_is_correct_path
===============================================================================
[ERROR]
Traceback (most recent call last):
Failure: twisted.internet.defer.TimeoutError: <ubuntuone.controlpanel.tests.test_web_client.WebClientBuildSignedIriTestCase testMethod=test_is_correct_scheme> (test_is_correct_scheme) still running at 10.0 secs

ubuntuone.controlpanel.tests.test_web_client.WebClientBuildSignedIriTestCase.test_is_correct_scheme
===============================================================================
[ERROR]
Traceback (most recent call last):
Failure: twisted.internet.defer.TimeoutError: <ubuntuone.controlpanel.tests.test_web_client.WebClientBuildSignedIriTestCase testMethod=test_unauthorized> (test_unauthorized) still running at 10.0 secs

ubuntuone.controlpanel.tests.test_web_client.WebClientBuildSignedIriTestCase.test_unauthorized
===============================================================================
[ERROR]
Traceback (most recent call last):
Failure: twisted.internet.defer.TimeoutError: <ubuntuone.controlpanel.tests.test_web_client.WebClientBuildSignedIriTestCase testMethod=test_url_with_query> (test_url_with_query) still running at 10.0 secs

ubuntuone.controlpanel.tests.test_web_client.WebClientBuildSignedIriTestCase.test_url_with_query
===============================================================================
[ERROR]
Traceback (most recent call last):
Failure: twisted.internet.defer.TimeoutError: <ubuntuone.controlpanel.tests.test_web_client.WebClientBuildSignedIriTestCase testMethod=test_uses_timestamper> (test_uses_timestamper) still running at 10.0 secs

ubuntuone.controlpanel.tests.test_web_client.WebClientBuildSignedIriTestCase.test_uses_timestamper
===============================================================================
[ERROR]
Traceback (most recent call last):
Failure: twisted.internet.defer.TimeoutError: <ubuntuone.controlpanel.tests.test_web_client.WebClientTestCase testMethod=test_get_url> (test_get_url) still running at 10.0 secs

ubuntuone.controlpanel.tests.test_web_client.WebClientTestCase.test_get_url
===============================================================================
[ERROR]
Traceback (most recent call last):
Failure: twisted.internet.defer.TimeoutError: <ubuntuone.controlpanel.tests.test_web_client.WebClientTestCase testMethod=test_get_url_error> (test_get_url_error) still running at 10.0 secs

ubuntuone.controlpanel.tests.test_web_client.WebClientTestCase.test_get_url_error
===============================================================================
[ERROR]
Traceback (most recent call last):
Failure: twisted.internet.defer.TimeoutError: <ubuntuone.controlpanel.tests.test_web_client.WebClientTestCase testMethod=test_unauthorized> (test_unauthorized) still running at 10.0 secs

ubuntuone.controlpanel.tests.test_web_client.WebClientTestCase.test_unauthorized
-------------------------------------------------------------------------------
Ran 373 tests in 121.670s

FAILED (errors=12, successes=361)

This appears to be due to the timestamp checker trying to hit the actual web service, and timing out.

Related branches

Changed in ubuntuone-control-panel:
status: Triaged → Fix Committed
Dave Morley (davmor2) on 2013-08-15
Changed in ubuntuone-control-panel:
importance: Undecided → Low
tags: added: u1-by-dev u1-on-dev
tags: added: u1-ubuntu
dobey (dobey) on 2013-08-15
Changed in ubuntuone-control-panel:
status: Fix Committed → Fix Released
To post a comment you must log in.
This report contains Public information  Edit
Everyone can see this information.

Other bug subscribers