opendrim-lmp-ssh version 1.0.0-0ubuntu1 failed to build on i386

Bug #756110 reported by Matthias Klose
This bug affects 1 person
Affects Status Importance Assigned to Milestone
opendrim-lmp-ssh (Ubuntu)
Sebastian Carneiro
Sebastian Carneiro

Bug Description

opendrim-lmp-ssh version 1.0.0-0ubuntu1 failed to build on i386
Link to failed build:

Direct link to the build log:

This log snippet might be of interest, since it triggered the matcher 'Purging chroot-autobuild'.
Excerpt 1538 lines into the build log:

mv -f .deps/testOpenDRIM_SSHProtocolCapabilities-testOpenDRIM_SSHProtocolCapabilities.Tpo .deps/testOpenDRIM_SSHProtocolCapabilities-testOpenDRIM_SSHProtocolCapabilities.Po
/bin/bash ../libtool --tag=CXX --mode=link g++ -Wall -Wunused -fPIC -fno-rtti -fno-exceptions -O2 -g -O2 -Wl,-Bsymbolic-functions -L. -L/usr/lib/cmpi -L/usr/lib/cmpi -o testOpenDRIM_SSHProtocolCapabilities testOpenDRIM_SSHProtocolCapabilities-testOpenDRIM_SSHProtocolCapabilities.o ../OpenDRIM_SSHProtocolCapabilities/
libtool: link: g++ -Wall -Wunused -fPIC -fno-rtti -fno-exceptions -O2 -g -O2 -Wl,-Bsymbolic-functions -o .libs/testOpenDRIM_SSHProtocolCapabilities testOpenDRIM_SSHProtocolCapabilities-testOpenDRIM_SSHProtocolCapabilities.o -L/build/buildd/opendrim-lmp-ssh-1.0.0/test -L/usr/lib/cmpi ../OpenDRIM_SSHProtocolCapabilities/.libs/ -Wl,-rpath -Wl,/usr/lib/cmpi
/usr/bin/ld: testOpenDRIM_SSHProtocolCapabilities-testOpenDRIM_SSHProtocolCapabilities.o: undefined reference to symbol 'Objectpath::toString() const'
/usr/bin/ld: note: 'Objectpath::toString() const' is defined in DSO /usr/lib/ so try adding it to the linker command line
/usr/lib/ could not read symbols: Invalid operation
collect2: ld returned 1 exit status
make[3]: *** [testOpenDRIM_SSHProtocolCapabilities] Error 1
make[3]: Leaving directory `/build/buildd/opendrim-lmp-ssh-1.0.0/test'
make[2]: *** [all-recursive] Error 1
make[2]: Leaving directory `/build/buildd/opendrim-lmp-ssh-1.0.0'
make[1]: *** [all] Error 2
make[1]: Leaving directory `/build/buildd/opendrim-lmp-ssh-1.0.0'
make: *** [build-stamp] Error 2
dpkg-buildpackage: error: debian/rules build gave error exit status 2
Build finished at 20110408-1527
FAILED [dpkg-buildpackage died]
Purging chroot-autobuild/build/buildd/opendrim-lmp-ssh-1.0.0

Related branches

Matthias Klose (doko)
Changed in opendrim-lmp-ssh (Ubuntu):
importance: Undecided → High
tags: added: oneiric
Changed in opendrim-lmp-ssh (Ubuntu):
milestone: none → oneiric-alpha-1
Changed in opendrim-lmp-ssh (Ubuntu Oneiric):
milestone: oneiric-alpha-1 → oneiric-alpha-2
Changed in opendrim-lmp-ssh (Ubuntu Oneiric):
assignee: nobody → Sebastian Carneiro (scarneiro)
status: New → In Progress
Changed in opendrim-lmp-ssh (Ubuntu Oneiric):
milestone: oneiric-alpha-2 → none
tags: added: multiverse
Revision history for this message
Launchpad Janitor (janitor) wrote :

This bug was fixed in the package opendrim-lmp-ssh - 1.0.0-0ubuntu2

opendrim-lmp-ssh (1.0.0-0ubuntu2) oneiric; urgency=low

  * debian/patches/01-ftbfs-add-opendrim-lib.patch: Added library opendrim to
    LIBS variable in check routine of acinclude.m4 to build with ld
    --as-needed (LP: #756110)
 -- Sebastian Carneiro <email address hidden> Thu, 07 Jul 2011 00:14:33 -0300

Changed in opendrim-lmp-ssh (Ubuntu Oneiric):
status: In Progress → Fix Released
To post a comment you must log in.
This report contains Public information  Edit
Everyone can see this information.

Other bug subscribers