cogl ftbfs in disco (i386 only)

Bug #1823448 reported by Matthias Klose on 2019-04-06
10
This bug affects 1 person
Affects Status Importance Assigned to Milestone
cogl (Ubuntu)
High
Sebastien Bacher
Disco
High
Sebastien Bacher

Bug Description

* Impact
It fails to build on i386 (hanging in tests)

* Test case
The i386 build should work

* Regression potential
There is no change to the code, just test that GNOME and the video player (cogl users) still work correctly

------------

https://launchpadlibrarian.net/417939758/buildlog_ubuntu-disco-i386.cogl_1.22.2-6_BUILDING.txt.gz

make check-local
make[5]: Entering directory '/<<PKGBUILDDIR>>/tests'
( cd ./conform && make test ) || exit $?
make[6]: Entering directory '/<<PKGBUILDDIR>>/tests/conform'
Key:
ok = Test passed
n/a = Driver is missing a feature required for the test
FAIL = Unexpected failure
FIXME = Test failed, but it was an expected failure
PASS! = Unexpected pass

                               Test GL+FF GL+ARBFP GL+GLSL GL-NPT GL3 ES2 ES2-NPT

         test_pipeline_user_matrix: ok ok ok ok ok ok ok
                test_blend_strings: ok ok ok ok ok ok ok
                        test_blend: ok ok ok ok ok ok ok
                      test_premult: FIXME FIXME FIXME FIXME FIXME FIXME FIXME
                         test_path: ok ok ok ok ok ok ok
                    test_path_clip: ok ok ok ok ok ok ok
                   test_depth_test: ok ok ok ok ok ok ok
                   test_color_mask: ok ok ok ok ok ok ok
make[6]: *** wait: No child processes. Stop.
make[3]: *** wait: No child processes. Stop.
make[6]: *** Waiting for unfinished jobs....
make[3]: *** Waiting for unfinished jobs....
make[3]: *** wait: No child processes. Stop.
make[6]: *** wait: No child processes. Stop.
make[2]: *** wait: No child processes. Stop.
make[2]: *** Waiting for unfinished jobs....
make[5]: *** [Makefile:875: test] Terminated
make[2]: *** wait: No child processes. Stop.
E: Caught signal ‘Terminated’: terminating immediately
make[4]: *** [Makefile:750: check-am] Terminated
make: *** [debian/rules:7: build-arch] Terminated
make[1]: [debian/rules:60: override_dh_auto_test] Terminated (ignored)
Build killed with signal TERM after 150 minutes of inactivity

Matthias Klose (doko) on 2019-04-06
Changed in cogl (Ubuntu):
importance: Undecided → High
tags: added: ftbfs rls-dd-incoming
Changed in cogl (Ubuntu):
assignee: nobody → Sebastien Bacher (seb128)
Iain Lane (laney) on 2019-04-09
tags: removed: rls-dd-incoming
Matthias Klose (doko) on 2019-06-18
tags: added: rls-ee-incoming
tags: removed: rls-ee-incoming
Sebastien Bacher (seb128) wrote :
Changed in cogl (Ubuntu):
status: New → Fix Released
description: updated
Changed in cogl (Ubuntu Disco):
status: New → Fix Committed

Hello Matthias, or anyone else affected,

Accepted cogl into disco-proposed. The package will build now and be available at https://launchpad.net/ubuntu/+source/cogl/1.22.2-6ubuntu1 in a few hours, and then in the -proposed repository.

Please help us by testing this new package. See https://wiki.ubuntu.com/Testing/EnableProposed for documentation on how to enable and use -proposed. Your feedback will aid us getting this update out to other Ubuntu users.

If this package fixes the bug for you, please add a comment to this bug, mentioning the version of the package you tested and change the tag from verification-needed-disco to verification-done-disco. If it does not fix the bug for you, please add a comment stating that, and change the tag to verification-failed-disco. In either case, without details of your testing we will not be able to proceed.

Further information regarding the verification process can be found at https://wiki.ubuntu.com/QATeam/PerformingSRUVerification . Thank you in advance for helping!

N.B. The updated package will be released to -updates after the bug(s) fixed by this package have been verified and the package has been in -proposed for a minimum of 7 days.

tags: added: block-proposed-disco
tags: added: verification-needed verification-needed-disco
To post a comment you must log in.
This report contains Public information  Edit
Everyone can see this information.

Other bug subscribers