python-pbr ftbfs in 18.04 LTS

Bug #1813595 reported by Matthias Klose
6
This bug affects 1 person
Affects Status Importance Assigned to Milestone
python-pbr (Ubuntu)
High
Unassigned
Bionic
High
Unassigned

Bug Description

according to
http://people.canonical.com/~doko/ftbfs-report/test-rebuild-20181222-bionic.html

python-pbr ftbfs.

Ran 184 tests in 55.965s

FAILED (failures=26, skipped=22)
debian/rules:24: recipe for target 'override_dh_auto_test' failed
make[1]: *** [override_dh_auto_test] Error 1
make[1]: Leaving directory '/<<PKGBUILDDIR>>'
debian/rules:10: recipe for target 'build' failed
make: *** [build] Error 2

Matthias Klose (doko)
Changed in python-pbr (Ubuntu):
importance: Undecided → High
Changed in python-pbr (Ubuntu Bionic):
importance: Undecided → High
tags: added: ftbfs rls-bb-incoming
James Page (james-page)
Changed in python-pbr (Ubuntu):
status: New → Fix Released
Changed in python-pbr (Ubuntu Bionic):
status: New → Fix Released
status: Fix Released → New
Revision history for this message
James Page (james-page) wrote :

Confirmed still and issue for Bionic.

Changed in python-pbr (Ubuntu Bionic):
status: New → Triaged
To post a comment you must log in.
This report contains Public information  Edit
Everyone can see this information.

Other bug subscribers