yafaray version 0.1.2~beta2-1 failed to build on armhf

Bug #945384 reported by Ricardo Salveti on 2012-03-03
6
This bug affects 1 person
Affects Status Importance Assigned to Milestone
yafaray (Debian)
Fix Released
Unknown
yafaray (Ubuntu)
High
Unassigned

Bug Description

yafaray version 0.1.2~beta2-1 failed to build on armhf
Link to failed build: https://launchpad.net/ubuntu/+source/yafaray/0.1.2~beta2-1/+build/2969729

Direct link to the build log: https://launchpad.net/ubuntu/+source/yafaray/0.1.2~beta2-1/+build/2969729/+files/buildlog_ubuntu-precise-armhf.yafaray_0.1.2%7Ebeta2-1_FAILEDTOBUILD.txt.gz

This log snippet might be of interest, since it triggered the matcher 'Purging chroot-autobuild'.
Excerpt 1145 lines into the build log:

make[3]: Entering directory `/build/buildd/yafaray-0.1.2~beta2/build'
[ 97%] Building CXX object src/xml_loader/CMakeFiles/yafaray-xml.dir/xml-loader.cc.o
Linking CXX executable yafaray-xml
../yafraycore/libyafaraycore.so: undefined reference to `vtable for yafaray::triangleInstance_t'
../yafraycore/libyafaraycore.so: undefined reference to `vtable for yafaray::triangle_t'
collect2: ld returned 1 exit status
make[3]: *** [src/xml_loader/yafaray-xml] Error 1
make[3]: Leaving directory `/build/buildd/yafaray-0.1.2~beta2/build'
make[2]: *** [src/xml_loader/CMakeFiles/yafaray-xml.dir/all] Error 2
make[2]: Leaving directory `/build/buildd/yafaray-0.1.2~beta2/build'
make[1]: *** [all] Error 2
make[1]: Leaving directory `/build/buildd/yafaray-0.1.2~beta2/build'
dh_auto_build: make -j1 returned exit code 2
make: *** [build] Error 2
dpkg-buildpackage: error: debian/rules build gave error exit status 2
******************************************************************************
Build finished at 20120111-1603
FAILED [dpkg-buildpackage died]
Purging chroot-autobuild/build/buildd/yafaray-0.1.2~beta2

Changed in yafaray (Ubuntu):
status: New → Confirmed
importance: Undecided → High
Changed in yafaray (Debian):
status: Unknown → Confirmed
Changed in yafaray (Debian):
status: Confirmed → Fix Released
Jeremy Bicha (jbicha) wrote :

yafaray builds on armhf on Saucy now

Changed in yafaray (Ubuntu):
status: Confirmed → Fix Released
To post a comment you must log in.
This report contains Public information  Edit
Everyone can see this information.

Other bug subscribers

Remote bug watches

Bug watches keep track of this bug in other bug trackers.