yabause version 0.9.11-1 failed to build on armhf

Bug #945348 reported by Ricardo Salveti on 2012-03-03
This bug report is a duplicate of:  Bug #944749: ftfbs on armhf. Edit Remove
6
This bug affects 1 person
Affects Status Importance Assigned to Milestone
yabause (Ubuntu)
High
Unassigned

Bug Description

yabause version 0.9.11-1 failed to build on armhf
Link to failed build: https://launchpad.net/ubuntu/+source/yabause/0.9.11-1/+build/2991317

Direct link to the build log: https://launchpad.net/ubuntu/+source/yabause/0.9.11-1/+build/2991317/+files/buildlog_ubuntu-precise-armhf.yabause_0.9.11-1_FAILEDTOBUILD.txt.gz

This log snippet might be of interest, since it triggered the matcher 'Purging chroot-autobuild'.
Excerpt 1537 lines into the build log:

cd /build/buildd/yabause-0.9.11/obj-arm-linux-gnueabihf/src && /usr/bin/gcc -DHAVE_C99_VARIADIC_MACROS=1 -DHAVE_GETTIMEOFDAY=1 -DHAVE_FLOORF=1 -DHAVE_SYS_TIME_H=1 -DHAVE_STDINT_H=1 -DHAVE_LIBGL=1 -DHAVE_LIBGLUT=1 -DHAVE_GLXGETPROCADDRESS=1 -DHAVE_LIBSDL=1 -DHAVE_LIBAL=1 -DHAVE_LIBMINI18N=1 -DYTSDIR=\"/usr/share//yts\" -DSH2_DYNAREC=1 -DHAVE_C68K=1 -DARCH_IS_LINUX=1 -DLINUX_CDROM_H_IS_BROKEN -DPACKAGE=\"yabause\" -DVERSION=\"0.9.11\" -O3 -mcpu=cortex-a8 -mfpu=vfp -mfloat-abi=softfp -I/usr/include/SDL -I/usr/include/AL -I/build/buildd/yabause-0.9.11/obj-arm-linux-gnueabihf/src/c68k -o CMakeFiles/yabause.dir/bios.c.o -c /build/buildd/yabause-0.9.11/src/bios.c
In file included from /usr/include/stdlib.h:25:0,
                 from /build/buildd/yabause-0.9.11/src/memory.h:24,
                 from /build/buildd/yabause-0.9.11/src/bios.c:20:
/usr/include/features.h:323:26: fatal error: bits/predefs.h: No such file or directory
compilation terminated.
make[3]: *** [src/CMakeFiles/yabause.dir/bios.c.o] Error 1
make[3]: Leaving directory `/build/buildd/yabause-0.9.11/obj-arm-linux-gnueabihf'
make[2]: *** [src/CMakeFiles/yabause.dir/all] Error 2
make[2]: Leaving directory `/build/buildd/yabause-0.9.11/obj-arm-linux-gnueabihf'
make[1]: *** [all] Error 2
make[1]: Leaving directory `/build/buildd/yabause-0.9.11/obj-arm-linux-gnueabihf'
dh_auto_build: make -j1 returned exit code 2
make: *** [build] Error 2
dpkg-buildpackage: error: debian/rules build gave error exit status 2
******************************************************************************
Build finished at 20120110-2029
FAILED [dpkg-buildpackage died]
Purging chroot-autobuild/build/buildd/yabause-0.9.11

Changed in yabause (Ubuntu):
status: New → Confirmed
importance: Undecided → High
To post a comment you must log in.
This report contains Public information  Edit
Everyone can see this information.

Other bug subscribers