xymon version 4.3.0~beta2.dfsg-6+squeeze1 failed to build on i386

Bug #749190 reported by Matthias Klose
6
This bug affects 1 person
Affects Status Importance Assigned to Milestone
xymon (Ubuntu)
Medium
Unassigned

Bug Description

xymon version 4.3.0~beta2.dfsg-6+squeeze1 failed to build on i386
Link to failed build: https://launchpad.net/ubuntu/+archive/test-rebuild-20110329/+buildjob/2414818

Direct link to the build log: https://launchpad.net/ubuntu/+archive/test-rebuild-20110329/+buildjob/2414818/+files/buildlog_ubuntu-natty-i386.xymon_4.3.0%7Ebeta2.dfsg-6%2Bsqueeze1_FAILEDTOBUILD.txt.gz

This log snippet might be of interest, since it triggered the matcher 'Purging chroot-autobuild'.
Excerpt 1424 lines into the build log:

Found RRDtool include files in /usr/include
make[1]: Entering directory `/build/buildd/xymon-4.3.0~beta2.dfsg/build'
make[1]: Leaving directory `/build/buildd/xymon-4.3.0~beta2.dfsg/build'
make[1]: Entering directory `/build/buildd/xymon-4.3.0~beta2.dfsg/build'
make[1]: Leaving directory `/build/buildd/xymon-4.3.0~beta2.dfsg/build'
make[1]: Entering directory `/build/buildd/xymon-4.3.0~beta2.dfsg/build'
make[1]: Leaving directory `/build/buildd/xymon-4.3.0~beta2.dfsg/build'
Found RRDtool libraries in /usr/lib
make[1]: Entering directory `/build/buildd/xymon-4.3.0~beta2.dfsg/build'
make[1]: Leaving directory `/build/buildd/xymon-4.3.0~beta2.dfsg/build'

Checking for PCRE ...
PCRE include- or library-files not found. These are REQUIRED for hobbitd
PCRE can be found at http://www.pcre.org/
If you have PCRE installed, use the "--pcreinclude DIR" and "--pcrelib DIR"
options to configure to specify where they are.
dh_testdir
# Parallel building does not work as of 4.3.0~beta2
PKGBUILD=1 /usr/bin/make -j1
make[1]: Entering directory `/build/buildd/xymon-4.3.0~beta2.dfsg'
make[1]: *** No targets specified and no makefile found. Stop.
make[1]: Leaving directory `/build/buildd/xymon-4.3.0~beta2.dfsg'
make: *** [build-stamp] Error 2
dpkg-buildpackage: error: debian/rules build gave error exit status 2
******************************************************************************
Build finished at 20110403-1025
FAILED [dpkg-buildpackage died]
Purging chroot-autobuild/build/buildd/xymon-4.3.0~beta2.dfsg

Steve Langasek (vorlon)
tags: added: multiarch
Changed in xymon (Ubuntu):
status: New → Triaged
importance: Undecided → Medium
Revision history for this message
Launchpad Janitor (janitor) wrote :

This bug was fixed in the package xymon - 4.3.0~beta2.dfsg-6+squeeze1ubuntu1

---------------
xymon (4.3.0~beta2.dfsg-6+squeeze1ubuntu1) natty; urgency=low

  * debian/rules: pass --with-pcrelib to find libpcre in the multiarch dir.
    LP: #749190.
 -- Steve Langasek <email address hidden> Fri, 15 Apr 2011 01:15:22 -0700

Changed in xymon (Ubuntu):
status: Triaged → Fix Released
To post a comment you must log in.
This report contains Public information  Edit
Everyone can see this information.

Other bug subscribers