xstarfish version 1.1-11 failed to build in oneiric

Bug #832847 reported by Matthias Klose on 2011-08-24
6
This bug affects 1 person
Affects Status Importance Assigned to Milestone
xstarfish (Debian)
Fix Released
Unknown
xstarfish (Ubuntu)
High
Unassigned
Oneiric
High
Unassigned

Bug Description

xstarfish version 1.1-11 failed to build in oneiric
Link to failed build: https://launchpad.net/ubuntu/+archive/test-rebuild-20110816/+build/2715814

Details about the rebuild:
http://people.ubuntuwire.org/~wgrant/rebuild-ftbfs-test/test-rebuild-20110816-oneiric.html

Direct link to the build log: https://launchpad.net/ubuntu/+archive/test-rebuild-20110816/+build/2715814/+files/buildlog_ubuntu-oneiric-amd64.xstarfish_1.1-11_FAILEDTOBUILD.txt.gz

This log snippet might be of interest, since it triggered the matcher 'Purging chroot-autobuild'.
Excerpt 511 lines into the build log:

/build/buildd/xstarfish-1.1/./unix/makepng.c:59: undefined reference to `png_create_write_struct'
/build/buildd/xstarfish-1.1/./unix/makepng.c:69: undefined reference to `png_create_info_struct'
/build/buildd/xstarfish-1.1/./unix/makepng.c:91: undefined reference to `png_init_io'
/build/buildd/xstarfish-1.1/./unix/makepng.c:94: undefined reference to `png_set_IHDR'
/build/buildd/xstarfish-1.1/./unix/makepng.c:99: undefined reference to `png_write_info'
/build/buildd/xstarfish-1.1/./unix/makepng.c:102: undefined reference to `png_write_image'
/build/buildd/xstarfish-1.1/./unix/makepng.c:105: undefined reference to `png_write_end'
/build/buildd/xstarfish-1.1/./unix/makepng.c:106: undefined reference to `png_destroy_write_struct'
/build/buildd/xstarfish-1.1/./unix/makepng.c:84: undefined reference to `png_destroy_write_struct'
/build/buildd/xstarfish-1.1/./unix/makepng.c:73: undefined reference to `png_destroy_write_struct'
collect2: ld returned 1 exit status
make[1]: *** [starfish] Error 1
make[1]: Leaving directory `/build/buildd/xstarfish-1.1'
make: *** [build-stamp] Error 2
dpkg-buildpackage: error: debian/rules build gave error exit status 2
******************************************************************************
Build finished at 20110824-0757
FAILED [dpkg-buildpackage died]
Purging chroot-autobuild/build/buildd/xstarfish-1.1

Matthias Klose (doko) on 2011-08-24
Changed in xstarfish (Ubuntu):
status: New → Confirmed
importance: Undecided → High
Launchpad Janitor (janitor) wrote :

This bug was fixed in the package xstarfish - 1.1-11ubuntu1

---------------
xstarfish (1.1-11ubuntu1) oneiric; urgency=low

  * Fix build failure with ld --as-needed. LP: #832847.
 -- Matthias Klose <email address hidden> Mon, 12 Sep 2011 10:22:33 +0200

Changed in xstarfish (Ubuntu Oneiric):
status: Confirmed → Fix Released
Changed in xstarfish (Debian):
status: Unknown → New
Changed in xstarfish (Debian):
status: New → Fix Released
To post a comment you must log in.
This report contains Public information  Edit
Everyone can see this information.

Other bug subscribers

Remote bug watches

Bug watches keep track of this bug in other bug trackers.