wine1.2 version 1.2.2-0ubuntu4 failed to build on armel

Bug #745856 reported by Steve Langasek
This bug affects 1 person
Affects Status Importance Assigned to Milestone
wine1.2 (Ubuntu)
Fix Released
Scott Ritchie

Bug Description

wine1.2 version 1.2.2-0ubuntu4 failed to build on armel
Link to failed build:

Direct link to the build log:

This log snippet might be of interest, since it triggered the matcher 'Purging chroot-autobuild'.
Excerpt 4235 lines into the build log:

make[2]: Leaving directory `/build/buildd/wine1.2-1.2.2/dlls/xinput1_3'
rm -f dlls/libxinput.def && ln -s xinput1_3/libxinput.def dlls/libxinput.def
make[2]: Entering directory `/build/buildd/wine1.2-1.2.2/dlls/acledit'
arm-linux-gnueabi-gcc -c -I. -I. -I../../include -I../../include -D__WINESRC__ -D_REENTRANT -fPIC -Wall -pipe -fno-strict-aliasing -Wdeclaration-after-statement -Wstrict-prototypes -Wtype-limits -Wwrite-strings -Wpointer-arith -Wall -g -O2 -U_FORTIFY_SOURCE -D_FORTIFY_SOURCE=0 -o main.o main.c
../../tools/winegcc/winegcc -B../../tools/winebuild --sysroot=../.. -fasynchronous-unwind-tables -shared ./acledit.spec main.o -o -lkernel32 ../../libs/port/libwine_port.a
acledit.A9vBkI.s: Assembler messages:
acledit.A9vBkI.s:156: Error: symbol .data is in a different section
winebuild: /usr/bin/as failed with status 256
winegcc: ../../tools/winebuild/winebuild failed
make[2]: *** [] Error 2
make[2]: Leaving directory `/build/buildd/wine1.2-1.2.2/dlls/acledit'
make[1]: *** [dlls/acledit] Error 2
make[1]: Leaving directory `/build/buildd/wine1.2-1.2.2'
make: *** [build-stamp] Error 2
dpkg-buildpackage: error: debian/rules build gave error exit status 2
Build finished at 20110330-0859
FAILED [dpkg-buildpackage died]
Purging chroot-autobuild/build/buildd/wine1.2-1.2.2

Related branches

Steve Langasek (vorlon)
Changed in wine1.2 (Ubuntu):
importance: Undecided → Low
status: New → Triaged
Revision history for this message
Scott Ritchie (scottritchie) wrote :

Wine1.2 doesn't actually have ARM support, but Wine1.3 does. I'll get it to stop trying ;)

Changed in wine1.2 (Ubuntu):
assignee: nobody → Scott Ritchie (scottritchie)
Revision history for this message
Launchpad Janitor (janitor) wrote :

This bug was fixed in the package wine1.2 - 1.2.2-0ubuntu5

wine1.2 (1.2.2-0ubuntu5) natty; urgency=low

  * Merge in some changes from wine1.3 packaging
    - New 24x24 icons to populate Applications menu
    - Font replacements instead of aliases
  * debian/control:
    - Do not recommend wisotool
    - Remove some ancient conflicts that haven't been packages for a long time
    - wine1.2 is NOT a beta package
    - Remove wine-gecko, now unneeded
    - Remove wine-dev, now unneeded
    - Add conflicts: wine-dev to remove dummy
    - wine-gecko conflicts should be in wine1.2-gecko/wine1.3-gecko packages
    - wine is now a dependency package a la python, depends on wine1.3
    - xdg-utils promoted to recommends
    - set self to maintainer
    - shorten a description line (lintian)
    - bump standards to 3.9.1
    - quilt build depends was not missing, just unversioned
    - build-depend on debhelper 7
    - confine to arch: i386, amd64 (LP: #745856)
  * override lintian warning about static linking in wine-preloader
  * delete config.sub/config.guess, as well as references in rules file
  * Revert to upstream wine.desktop (different [it] translation)
  * debian/rules: use dh_prep instead of dh_clean -k (lintian)
  * add debian/README.source (lintian)
 -- Scott Ritchie <email address hidden> Mon, 04 Apr 2011 02:04:46 -0700

Changed in wine1.2 (Ubuntu):
status: Triaged → Fix Released
To post a comment you must log in.
This report contains Public information  
Everyone can see this information.

Other bug subscribers

Remote bug watches

Bug watches keep track of this bug in other bug trackers.