wagon version 1.0.0-2ubuntu3 failed to build with openjdk-7 as default-jdk

Bug #1009483 reported by James Page on 2012-06-06
12
This bug affects 2 people
Affects Status Importance Assigned to Milestone
wagon (Ubuntu)
Undecided
Unassigned

Bug Description

During a rebuild test with default-jdk switched to openjdk-7 (as it is in quantal), a build failure was detected for wagon version 1.0.0-2ubuntu3.

See attached log for full build failure details.

https://wiki.ubuntu.com/JavaTeam/Java7Default contains more details of how to diagnose and resolve these types of issues.

This log snippet might also be of interest:

[INFO]
NOTE: Maven is executing in offline mode. Any artifacts not already in your local
repository will be inaccessible.

[INFO] Scanning for projects...
[INFO] Reactor build order:
[INFO] Maven Wagon
[INFO] Maven Wagon API
[INFO] Maven Wagon Provider Test
[INFO] Maven Wagon Providers
[INFO] Maven Wagon File Provider
[INFO] Maven Wagon FTP Provider
[INFO] Maven Wagon HTTP Shared Library
[INFO] Maven Wagon Lightweight HTTP Provider
[INFO] Maven Wagon HTTP Provider
[INFO] Maven Wagon SCM Provider
[INFO] Maven Wagon SSH Common Library
[INFO] Maven Wagon SSH Common Tests
[INFO] Maven Wagon SSH External Provider
[INFO] Maven Wagon SSH Provider
[INFO] Maven Test Compatibility Kits
[INFO] Wagon HTTP Test Compatibility Kit
[INFO] ------------------------------------------------------------------------
[INFO] Building Maven Wagon
[INFO] task-segment: [install]
[INFO] ------------------------------------------------------------------------
[INFO] [plexus:descriptor {execution: generate}]
[INFO] [site:attach-descriptor {execution: default-attach-descriptor}]
[INFO] [install:install {execution: default-install}]
[INFO] Installing /«PKGBUILDDIR»/pom.xml to /«PKGBUILDDIR»/debian/maven-repo/org/apache/maven/wagon/wagon/1.0/wagon-1.0.pom
[INFO] ------------------------------------------------------------------------
[ERROR] BUILD ERROR
[INFO] ------------------------------------------------------------------------
[INFO] Error installing artifact: Unable to open file /«PKGBUILDDIR»/debian/maven-repo/org/apache/maven/wagon/wagon/1.0/wagon-1.0.pom for writing.

[INFO] ------------------------------------------------------------------------
[INFO] For more information, run Maven with the -e switch
[INFO] ------------------------------------------------------------------------
[INFO] Total time: 2 seconds
[INFO] Finished at: Sun Jun 03 08:15:50 BST 2012
[INFO] Final Memory: 15M/289M
[INFO] ------------------------------------------------------------------------
make: *** [mvn-build] Error 1
dpkg-buildpackage: error: debian/rules build gave error exit status 2
────────────────────────────────────────────────────────────────────────────────
Build finished at 20120603-0815

Finished
────────

E: Build failure (dpkg-buildpackage died)

tags: added: amd64 auto ftbfs java7-ftbfs
Launchpad Janitor (janitor) wrote :

Status changed to 'Confirmed' because the bug affects multiple users.

Changed in wagon (Ubuntu):
status: New → Confirmed
To post a comment you must log in.
This report contains Public information  Edit
Everyone can see this information.

Other bug subscribers

Bug attachments