virtualbox-dkms 4.1.12-dfsg-2ubuntu0.6: virtualbox kernel module failed to build

Bug #1349094 reported by Doug Rawson
8
This bug affects 1 person
Affects Status Importance Assigned to Milestone
virtualbox (Ubuntu)
New
Undecided
Unassigned

Bug Description

DKMS make.log for virtualbox-4.1.12 for kernel 3.13.0-30-generic (x86_64)
Sun Jul 27 08:34:11 EDT 2014
make: Entering directory `/usr/src/linux-headers-3.13.0-30-generic'
  LD /var/lib/dkms/virtualbox/4.1.12/build/built-in.o
  LD /var/lib/dkms/virtualbox/4.1.12/build/vboxdrv/built-in.o
  CC [M] /var/lib/dkms/virtualbox/4.1.12/build/vboxdrv/linux/SUPDrv-linux.o
/var/lib/dkms/virtualbox/4.1.12/build/vboxdrv/linux/SUPDrv-linux.c: In function ‘vboxdrvLinuxUid’:
/var/lib/dkms/virtualbox/4.1.12/build/vboxdrv/linux/SUPDrv-linux.c:226:5: error: incompatible types when returning type ‘kuid_t’ but ‘RTUID’ was expected
/var/lib/dkms/virtualbox/4.1.12/build/vboxdrv/linux/SUPDrv-linux.c: In function ‘vboxdrvLinuxGid’:
/var/lib/dkms/virtualbox/4.1.12/build/vboxdrv/linux/SUPDrv-linux.c:235:5: error: incompatible types when returning type ‘kgid_t’ but ‘RTGID’ was expected
/var/lib/dkms/virtualbox/4.1.12/build/vboxdrv/linux/SUPDrv-linux.c: In function ‘vboxdrvLinuxEuid’:
/var/lib/dkms/virtualbox/4.1.12/build/vboxdrv/linux/SUPDrv-linux.c:244:5: error: incompatible types when returning type ‘kuid_t’ but ‘RTUID’ was expected
/var/lib/dkms/virtualbox/4.1.12/build/vboxdrv/linux/SUPDrv-linux.c:248:1: warning: control reaches end of non-void function [-Wreturn-type]
/var/lib/dkms/virtualbox/4.1.12/build/vboxdrv/linux/SUPDrv-linux.c: In function ‘vboxdrvLinuxUid’:
/var/lib/dkms/virtualbox/4.1.12/build/vboxdrv/linux/SUPDrv-linux.c:230:1: warning: control reaches end of non-void function [-Wreturn-type]
/var/lib/dkms/virtualbox/4.1.12/build/vboxdrv/linux/SUPDrv-linux.c: In function ‘vboxdrvLinuxGid’:
                                                                                                                        1,1 To
make[2]: *** [/var/lib/dkms/virtualbox/4.1.12/build/vboxdrv/linux/SUPDrv-linux.o] Error 1
make[1]: *** [/var/lib/dkms/virtualbox/4.1.12/build/vboxdrv] Error 2
make: *** [_module_/var/lib/dkms/virtualbox/4.1.12/build] Error 2
make: Leaving directory `/usr/src/linux-headers-3.13.0-30-generic'

ProblemType: Package
DistroRelease: Ubuntu 12.04
Package: virtualbox-dkms 4.1.12-dfsg-2ubuntu0.6
ProcVersionSignature: Ubuntu 3.13.0-30.55~precise1-generic 3.13.11.2
Uname: Linux 3.13.0-30-generic x86_64
NonfreeKernelModules: wl
ApportVersion: 2.0.1-0ubuntu17.6
Architecture: amd64
DKMSKernelVersion: 3.13.0-30-generic
Date: Sun Jul 27 08:34:18 2014
InstallationMedia: Ubuntu 12.04.4 LTS "Precise Pangolin" - Release amd64 (20140204)
MarkForUpload: True
PackageArchitecture: all
PackageVersion: 4.1.12-dfsg-2ubuntu0.6
SourcePackage: virtualbox
Title: virtualbox-dkms 4.1.12-dfsg-2ubuntu0.6: virtualbox kernel module failed to build
UpgradeStatus: No upgrade log present (probably fresh install)
VirtualBox.ModInfo:

Revision history for this message
Doug Rawson (dougrawson) wrote :
tags: removed: need-duplicate-check
Revision history for this message
Doug Rawson (dougrawson) wrote :

Hope I did this right.

Thanks.

To post a comment you must log in.
This report contains Public information  
Everyone can see this information.

Other bug subscribers

Remote bug watches

Bug watches keep track of this bug in other bug trackers.