vim ftbfs in cosmic (i386 only)

Bug #1823651 reported by Matthias Klose on 2019-04-08
6
This bug affects 1 person
Affects Status Importance Assigned to Milestone
vim (Ubuntu)
High
Unassigned

Bug Description

https://launchpadlibrarian.net/418305601/buildlog_ubuntu-cosmic-i386.vim_2%3A8.0.1766-1ubuntu1_BUILDING.txt.gz

Executed 354 tests

From test_terminal.vim:
Found errors in Test_terminal_tmap():
First run:
Caught exception in Test_terminal_tmap(): WaitFor() timed out after 5000 msec @ function RunTheTest[38]..Test_terminal_tmap[1]..TerminalTmap[14]..WaitFor, line 25
Second run:
Caught exception in Test_terminal_tmap(): WaitFor() timed out after 5000 msec @ function RunTheTest[38]..Test_terminal_tmap[1]..TerminalTmap[14]..WaitFor, line 25

Test results:

From test_terminal.vim:
Found errors in Test_terminal_tmap():
First run:
Caught exception in Test_terminal_tmap(): WaitFor() timed out after 5000 msec @ function RunTheTest[38]..Test_terminal_tmap[1]..TerminalTmap[14]..WaitFor, line 25
Second run:
Caught exception in Test_terminal_tmap(): WaitFor() timed out after 5000 msec @ function RunTheTest[38]..Test_terminal_tmap[1]..TerminalTmap[14]..WaitFor, line 25
TEST FAILURE
make[2]: *** [Makefile:43: report] Error 1
make[2]: Leaving directory '/<<PKGBUILDDIR>>/src/vim-gtk3/testdir'
make[1]: *** [Makefile:2075: scripttests] Error 2
make[1]: Leaving directory '/<<PKGBUILDDIR>>/src/vim-gtk3'
make: *** [debian/rules:266: build-stamp-vim-gtk3] Error 2

Matthias Klose (doko) on 2019-04-08
Changed in vim (Ubuntu):
importance: Undecided → High
tags: added: ftbfs rls-cc-incoming
To post a comment you must log in.
This report contains Public information  Edit
Everyone can see this information.

Other bug subscribers