folks fails to build from source in maverick

Bug #651244 reported by Matthias Klose on 2010-09-29
10
This bug affects 2 people
Affects Status Importance Assigned to Milestone
vala (Ubuntu)
High
Chris Coulson
Maverick
High
Chris Coulson

Bug Description

seen in http://people.ubuntuwire.org/~lucas/ubuntu-nbs/32/folks_0.1.17-0ubuntu2_lubuntu32.buildlog
and a local rebuild

Making all in lib
make[5]: Entering directory `/build/user-folks_0.1.17-0ubuntu2-i386-kCNmID/folks-0.1.17/backends/telepathy/lib'
  CC libtp_lowlevel_la-tp-lowlevel.lo
/bin/bash ../../../libtool --silent --tag=CC --mode=compile gcc -DHAVE_CONFIG_H -I. -I../../.. -pthread -I/usr/include/glib-2.0 -I/usr/lib/glib-2.0/include -pthread -I/usr/include/glib-2.0 -I/usr/lib/glib-2.0/include -pthread -I/usr/include/gee-1.0 -I/usr/include/glib-2.0 -I/usr/lib/glib-2.0/include -pthread -I/usr/include/telepathy-1.0 -I/usr/include/dbus-1.0 -I/usr/include/glib-2.0 -I/usr/lib/glib-2.0/include -I/usr/lib/dbus-1.0/include -I../../../folks -include ../../../config.h -DPACKAGE_DATADIR=\"/usr/share/folks\" -DG_LOG_DOMAIN=\"TelepathyBackend\" -g -O2 -c -o libtp_lowlevel_la-tp-lowlevel.lo `test -f 'tp-lowlevel.c' || echo './'`tp-lowlevel.c
  CCLD libtp-lowlevel.la
  GISCAN tp-lowlevel.gir
  GEN tp-lowlevel.vapi
tp-lowlevel.gir:70.7-70.6: error: invalid closure index
Generation failed: 1 error(s), 0 warning(s)
make[5]: *** [tp-lowlevel.vapi] Error 1
make[5]: Leaving directory `/build/user-folks_0.1.17-0ubuntu2-i386-kCNmID/folks-0.1.17/backends/telepathy/lib'
make[4]: *** [all-recursive] Error 1
make[4]: Leaving directory `/build/user-folks_0.1.17-0ubuntu2-i386-kCNmID/folks-0.1.17/backends/telepathy'
make[3]: *** [all-recursive] Error 1
make[3]: Leaving directory `/build/user-folks_0.1.17-0ubuntu2-i386-kCNmID/folks-0.1.17/backends'
make[2]: *** [all-recursive] Error 1
make[2]: Leaving directory `/build/user-folks_0.1.17-0ubuntu2-i386-kCNmID/folks-0.1.17'
make[1]: *** [all] Error 2
make[1]: Leaving directory `/build/user-folks_0.1.17-0ubuntu2-i386-kCNmID/folks-0.1.17'
dh_auto_build: make -j1 returned exit code 2
make: *** [build] Error 2

Matthias Klose (doko) on 2010-09-29
Changed in folks (Ubuntu):
assignee: nobody → Didier Roche (didrocks)
importance: Undecided → High
milestone: none → ubuntu-10.10
status: New → Confirmed
Didier Roche (didrocks) on 2010-09-29
Changed in folks (Ubuntu Maverick):
assignee: Didier Roche (didrocks) → Chris Coulson (chrisccoulson)
Didier Roche (didrocks) wrote :

from IRC discussion:
17:57:30 didrocks | I've just been assigned folks… I think vapi is still playing with us
17:58:04 seb128 | didrocks, can you bounce back to chrisccoulson I think it's similar to telepathy-glib

kthxbye as mvo would tell :)

more seriously do not hesitate to ping me if help is needed.

affects: folks (Ubuntu Maverick) → vala (Ubuntu Maverick)
Changed in vala (Ubuntu Maverick):
status: Confirmed → In Progress
Launchpad Janitor (janitor) wrote :

This bug was fixed in the package vala - 0.10.0-0ubuntu3

---------------
vala (0.10.0-0ubuntu3) maverick; urgency=low

  * Fix LP: #651244 - fully revert the changes for the new GIR
    - update debian/patches/90_revert_use_new_gir_version.patch
 -- Chris Coulson <email address hidden> Wed, 29 Sep 2010 18:21:39 +0100

Changed in vala (Ubuntu Maverick):
status: In Progress → Fix Released
To post a comment you must log in.
This report contains Public information  Edit
Everyone can see this information.

Other bug subscribers