undertaker version 1.1-2 failed to build on i386

Bug #803209 reported by Stefano Rivera on 2011-06-28
6
This bug affects 1 person
Affects Status Importance Assigned to Milestone
undertaker (Debian)
Fix Released
Unknown
undertaker (Ubuntu)
Medium
Julian Taylor

Bug Description

undertaker version 1.1-2 failed to build on i386
Link to failed build: https://launchpad.net/ubuntu/+source/undertaker/1.1-2/+build/2594879

Direct link to the build log: https://launchpad.net/ubuntu/+source/undertaker/1.1-2/+build/2594879/+files/buildlog_ubuntu-oneiric-i386.undertaker_1.1-2_FAILEDTOBUILD.txt.gz

This log snippet might be of interest, since it triggered the matcher 'Purging chroot-autobuild'.
Excerpt 889 lines into the build log:

/usr/include/boost/wave/cpplexer/cpp_lex_interface_generator.hpp:92: undefined reference to `boost::wave::cpplexer::new_lexer_gen<__gnu_cxx::__normal_iterator<char*, std::basic_string<char, std::char_traits<char>, std::allocator<char> > >, boost::wave::util::file_position<boost::wave::util::flex_string<char, std::char_traits<char>, std::allocator<char>, boost::wave::util::CowString<boost::wave::util::AllocatorStringStorage<char, std::allocator<char> >, char*> > >, boost::wave::cpplexer::lex_token<boost::wave::util::file_position<boost::wave::util::flex_string<char, std::char_traits<char>, std::allocator<char>, boost::wave::util::CowString<boost::wave::util::AllocatorStringStorage<char, std::allocator<char> >, char*> > > > >::new_lexer(__gnu_cxx::__normal_iterator<char*, std::basic_string<char, std::char_traits<char>, std::allocator<char> > > const&, __gnu_cxx::__normal_iterator<char*, std::basic_string<char, std::char_traits<char>, std::allocator<char> > > const&, boost::wave::util::file_position<boost::wave::util::flex_string<char, std::char_traits<char>, std::allocator<char>, boost::wave::util::CowString<boost::wave::util::AllocatorStringStorage<char, std::allocator<char> >, char*> > > const&, boost::wave::language_support)'
libziz.a(Ziz.o): In function `__static_initialization_and_destruction_0':
/usr/include/boost/system/error_code.hpp:214: undefined reference to `boost::system::generic_category()'
/usr/include/boost/system/error_code.hpp:215: undefined reference to `boost::system::generic_category()'
/usr/include/boost/system/error_code.hpp:216: undefined reference to `boost::system::system_category()'
collect2: ld returned 1 exit status
make[3]: *** [zizler] Error 1
make[3]: Leaving directory `/build/buildd/undertaker-1.1/ziz'
make[2]: *** [../ziz/libziz.a] Error 2
make[2]: Leaving directory `/build/buildd/undertaker-1.1/undertaker'
make[1]: *** [undertaker/undertaker] Error 2
make[1]: Leaving directory `/build/buildd/undertaker-1.1'
dh_auto_build: make -j1 returned exit code 2
make: *** [build] Error 2
dpkg-buildpackage: error: debian/rules build gave error exit status 2
******************************************************************************
Build finished at 20110627-0915
FAILED [dpkg-buildpackage died]
Purging chroot-autobuild/build/buildd/undertaker-1.1

Related branches

Changed in undertaker (Ubuntu):
importance: Undecided → Medium
Julian Taylor (jtaylor) on 2011-07-01
Changed in undertaker (Ubuntu):
assignee: nobody → Julian Taylor (jtaylor)
status: New → In Progress
Julian Taylor (jtaylor) wrote :

patch available in debian bug

Changed in undertaker (Debian):
status: Unknown → New
Launchpad Janitor (janitor) wrote :

This bug was fixed in the package undertaker - 1.1-2ubuntu1

---------------
undertaker (1.1-2ubuntu1) oneiric; urgency=low

  * debian/patches/fix-as-needed-build.patch:
    - fix build with ld --as-needed (LP: #803209)
 -- Julian Taylor <email address hidden> Sun, 21 Aug 2011 17:05:37 +0200

Changed in undertaker (Ubuntu):
status: In Progress → Fix Released
Changed in undertaker (Debian):
status: New → Fix Released
To post a comment you must log in.
This report contains Public information  Edit
Everyone can see this information.

Other bug subscribers

Remote bug watches

Bug watches keep track of this bug in other bug trackers.