package update-manager 1:0.93.32 failed to install/upgrade: ErrorMessage: Errors were encountered while processing: ubuntustudio-menu

Bug #295263 reported by vvlads on 2008-11-07
8
Affects Status Importance Assigned to Milestone
ubuntustudio-menu (Ubuntu)
Undecided
Unassigned

Bug Description

Binary package hint: update-manager

Errors were encountered while processing:
 ubuntustudio-menu
Traceback (most recent call last):
  File "/usr/lib/python2.5/logging/__init__.py", line 753, in emit
    self.flush()
  File "/usr/lib/python2.5/logging/__init__.py", line 731, in flush
    self.stream.flush()
IOError: [Errno 9] Bad file descriptor
Traceback (most recent call last):
  File "/usr/lib/python2.5/logging/__init__.py", line 753, in emit
    self.flush()
  File "/usr/lib/python2.5/logging/__init__.py", line 731, in flush
    self.stream.flush()
IOError: [Errno 9] Bad file descriptor
Traceback (most recent call last):
  File "/usr/lib/python2.5/logging/__init__.py", line 753, in emit
    self.flush()
  File "/usr/lib/python2.5/logging/__init__.py", line 731, in flush
    self.stream.flush()
IOError: [Errno 9] Bad file descriptor

** (apport-gtk:21134): WARNING **: Invalid borders specified for theme pixmap:
        /usr/share/themes/Mac4Lin_GTK_Aqua_v0.3/gtk-2.0/Buttons/button-default.png,

ProblemType: Package
Architecture: i386
DistroRelease: Ubuntu 8.10
ErrorMessage: ErrorMessage: SystemError in cache.commit(): E:Sub-process /usr/bin/dpkg returned an error code (1), E:Sub-process /usr/bin/dpkg returned an error code (1)

NonfreeKernelModules: nvidia
Package: update-manager 1:0.93.32
PackageArchitecture: all
SourcePackage: update-manager
Title: package update-manager 1:0.93.32 failed to install/upgrade: ErrorMessage: SystemError in cache.commit(): E:Sub-process /usr/bin/dpkg returned an error code (1), E:Sub-process /usr/bin/dpkg returned an error code (1)
Uname: Linux 2.6.24-21-rt i686

vvlads (vlad-smolovik-info) wrote :
Jean-Baptiste Lallement (jibel) wrote :

Thanks for your report. Could you please attach the file /var/log/apt/term.log (you need superuser privileges in order to read that file)

THanks

Changed in update-manager:
status: New → Incomplete
Jean-Baptiste Lallement (jibel) wrote :

We are closing this bug report because it lacks the information we need to investigate the problem, as described in the previous comments. Please reopen it if you can give us the missing information, and don't hesitate to submit bug reports in the future. To reopen the bug report you can click on the current status, under the Status column, and change the Status back to "New". Thanks again!

Changed in ubuntustudio-menu:
status: Incomplete → Invalid
vvlads (vlad-smolovik-info) wrote :

Here you are.

I have managed to fix the problem by removing the ubuntustudio-menu component from the system; then made the update and upgrade and the component has been installed after that. Now everything works fine.

Best regards,
Vlad.

To post a comment you must log in.
This report contains Public information  Edit
Everyone can see this information.

Other bug subscribers