ubuntuone-client autopkg tests fail in trusty

Bug #1296656 reported by Matthias Klose on 2014-03-24
6
This bug affects 1 person
Affects Status Importance Assigned to Milestone
Ubuntu One Client
Undecided
Unassigned
ubuntuone-client (Ubuntu)
High
Unassigned
Trusty
High
Unassigned

Bug Description

see
https://jenkins.qa.ubuntu.com/view/Trusty/view/AutoPkgTest/job/trusty-adt-ubuntuone-client/

this blocks migration every time a build dependency of ubuntuone-client is uploaded. please either fix it or remove the failing tests if it is not fixed for trusty.

Matthias Klose (doko) wrote :

tests.platform.session.test_common.InhibitorTestCase.test_inihibit_returns_self
===============================================================================
[FAIL]
Traceback (most recent call last):
  File "/tmp/adt-run.NqdKJV/dsc0-build/ubuntuone-client-13.10/tests/syncdaemon/test_config.py", line 519, in test_load_branch_configuration
    self.assertIn(branch_config, config_files)
  File "/usr/lib/python2.7/dist-packages/twisted/trial/_synctest.py", line 416, in assertIn
    % (containee, container))
twisted.trial.unittest.FailTest: '/tmp/adt-run.NqdKJV/dsc0-build/ubuntuone-client-13.10/data/syncdaemon.conf' not in [u'/etc/xdg/ubuntuone/logging.conf', u'/etc/xdg/ubuntuone/syncdaemon.conf']

tests.syncdaemon.test_config.UnicodePathsTestCase.test_load_branch_configuration
===============================================================================
[ERROR]
Traceback (most recent call last):
  File "/usr/lib/python2.7/dist-packages/twisted/internet/defer.py", line 1099, in _inlineCallbacks
    result = g.send(result)
  File "/usr/lib/python2.7/dist-packages/ubuntuone-client/ubuntuone/platform/ipc/perspective_broker.py", line 97, in is_already_running
    ai = ActivationInstance(get_activation_config())
  File "/usr/lib/python2.7/dist-packages/ubuntuone-client/ubuntuone/platform/ipc/perspective_broker.py", line 76, in get_activation_config
    cmdline = get_sd_bin_cmd()
  File "/usr/lib/python2.7/dist-packages/ubuntuone-client/ubuntuone/syncdaemon/utils.py", line 69, in get_sd_bin_cmd
    return _get_bin_cmd(SYNCDAEMON_EXECUTABLE)
  File "/usr/lib/python2.7/dist-packages/ubuntuone-client/ubuntuone/syncdaemon/utils.py", line 53, in _get_bin_cmd
    app_names=DARWIN_APP_NAMES)
  File "/usr/lib/python2.7/dist-packages/dirspec/utils.py", line 99, in get_program_path
    "Could not find executable %r" % program_name)
exceptions.OSError: [Errno 2] Could not find executable 'ubuntuone-syncdaemon'

tests.platform.ipc.test_perspective_broker.IPCPortTestCase.test_is_already_running_no
tests.platform.ipc.test_perspective_broker.IPCPortTestCase.test_is_already_running_yes
-------------------------------------------------------------------------------
Ran 2776 tests in 112.965s

FAILED (skips=34, failures=1, errors=2, successes=2739)

Changed in ubuntuone-client (Ubuntu):
importance: Undecided → High
milestone: none → ubuntu-14.04-beta-2
status: New → Confirmed
Changed in ubuntuone-client:
status: New → Confirmed
tags: added: autopkgtest qa-daily-testing
To post a comment you must log in.
This report contains Public information  Edit
Everyone can see this information.

Other bug subscribers