tulip version 3.1.2-2.3ubuntu3 failed to build on armhf

Bug #945350 reported by Ricardo Salveti on 2012-03-03
6
This bug affects 1 person
Affects Status Importance Assigned to Milestone
tulip (Ubuntu)
High
Unassigned

Bug Description

tulip version 3.1.2-2.3ubuntu3 failed to build on armhf
Link to failed build: https://launchpad.net/ubuntu/+source/tulip/3.1.2-2.3ubuntu3/+build/2968800

Direct link to the build log: https://launchpad.net/ubuntu/+source/tulip/3.1.2-2.3ubuntu3/+build/2968800/+files/buildlog_ubuntu-precise-armhf.tulip_3.1.2-2.3ubuntu3_FAILEDTOBUILD.txt.gz

This log snippet might be of interest, since it triggered the matcher 'Purging chroot-autobuild'.
Excerpt 2626 lines into the build log:

/usr/include/GL/gl.h:168:17: error: 'GLdouble' has a previous declaration as 'typedef double GLdouble'
make[6]: *** [GlMainWidget.lo] Error 1
make[6]: Leaving directory `/build/buildd/tulip-3.1.2/BUILD/library/tulip-qt/src'
make[5]: *** [all] Error 2
make[5]: Leaving directory `/build/buildd/tulip-3.1.2/BUILD/library/tulip-qt/src'
make[4]: *** [all-recursive] Error 1
make[4]: Leaving directory `/build/buildd/tulip-3.1.2/BUILD/library/tulip-qt'
make[3]: *** [all-recursive] Error 1
make[3]: Leaving directory `/build/buildd/tulip-3.1.2/BUILD/library'
make[2]: *** [all-recursive] Error 1
make[2]: Leaving directory `/build/buildd/tulip-3.1.2/BUILD'
make[1]: *** [all] Error 2
make[1]: Leaving directory `/build/buildd/tulip-3.1.2/BUILD'
make: *** [/build/buildd/tulip-3.1.2/stamps/build] Error 2
dpkg-buildpackage: error: debian/rules build gave error exit status 2
******************************************************************************
Build finished at 20120111-2009
FAILED [dpkg-buildpackage died]
Purging chroot-autobuild/build/buildd/tulip-3.1.2

Changed in tulip (Ubuntu):
status: New → Confirmed
importance: Undecided → High
tags: added: opengles
To post a comment you must log in.
This report contains Public information  Edit
Everyone can see this information.

Other bug subscribers