Bug #589142 reported by Angel Abad on 2010-06-03
This bug affects 1 person
Affects Status Importance Assigned to Milestone
tickcount (Ubuntu)
Thierry Carrez

Bug Description

Hi! Building tickcount in an updated maverick pbuilder I get this error:

dh_installmime -ppython-tickcount
PYTHONPATH=/tmp/buildd/tickcount-0.1/debian/python-tickcount//usr/lib/pyshared/python2.6 python test_tickcount.py
Traceback (most recent call last):
  File "test_tickcount.py", line 20, in <module>
    import tickcount
ImportError: No module named tickcount
make: *** [binary-install/python-tickcount] Error 1
dpkg-buildpackage: error: fakeroot debian/rules binary gave error exit status 2

PYTHONPATH in debian/rules is erroneus.


Related branches

Angel Abad (angelabad) wrote :

Fix PYTHONPATH and some lintian errors.


tags: added: patch
Scott Moser (smoser) on 2010-06-03
Changed in tickcount (Ubuntu):
status: New → Triaged
importance: Undecided → Medium
Changed in tickcount (Ubuntu):
assignee: nobody → Stefano Rivera (stefanor)
status: Triaged → In Progress
Stefano Rivera (stefanor) wrote :

Made a few changes, uploading

Changed in tickcount (Ubuntu):
assignee: Stefano Rivera (stefanor) → nobody
status: In Progress → Fix Committed
Stefano Rivera (stefanor) wrote :

Err, how I did I not notice this was main...

Changed in tickcount (Ubuntu):
status: Fix Committed → Confirmed
Stefano Rivera (stefanor) wrote :
Thierry Carrez (ttx) on 2010-06-28
Changed in tickcount (Ubuntu):
assignee: nobody → Thierry Carrez (ttx)
status: Confirmed → In Progress
Launchpad Janitor (janitor) wrote :

This bug was fixed in the package tickcount - 0.1-0ubuntu11

tickcount (0.1-0ubuntu11) maverick; urgency=low

  [ Angel Abad ]
  * debian/rules: Fix PYTHONPATH for python test (LP: #589142)
  * debian/control:
    - Add misc:Depends and shlibs:Depends
    - Fix typos
    - Remove python:Provides
    - Bump python-support B-D to >= 0.5.3
  * Switch to dpkg-source format 3.0 (quilt)
    - New patch: arm-test based on Chuck Short's fixes
  * debian/copyright: Fix license file location
  * debian/pycompat: Removed
  * Bump Standards-Version to 3.8.4

  [ Stefano Rivera ]
  * debian/control: Remove abandoned Vcs-Bzr entries
  * correct whitespace in arm-test patch
 -- Angel Abad <email address hidden> Thu, 03 Jun 2010 14:09:22 +0200

Changed in tickcount (Ubuntu):
status: In Progress → Fix Released
To post a comment you must log in.
This report contains Public information  Edit
Everyone can see this information.

Other bug subscribers