Activity log for bug #1304972

Date Who What changed Old value New value Message
2014-04-09 10:25:47 Jean-Baptiste Lallement bug added bug
2014-04-09 10:27:11 Jean-Baptiste Lallement description Precise AMD64 to Trusty upgrade with all of main installed. ProblemType: Package DistroRelease: Ubuntu 14.04 Package: tex-common 4.04 Uname: Linux 3.11.0-19-generic x86_64 Architecture: amd64 Date: Wed Apr 9 10:19:44 2014 ErrorMessage: ErrorMessage: subprocess installed post-installation script returned error exit status 1 MarkForUpload: True PackageArchitecture: all SourcePackage: tex-common Title: package tex-common 4.04 failed to install/upgrade: ErrorMessage: subprocess installed post-installation script returned error exit status 1 Precise AMD64 to Trusty upgrade with all of main installed. tex-common crashes with: Processing triggers for tex-common (4.04) ... Running updmap-sys. This may take some time... updmap-sys failed. Output has been stored in /tmp/updmap.CGJydbZz Please include this file if you report a bug. Sometimes, not accepting conffile updates in /etc/texmf/updmap.d causes updmap-sys to fail. Please check for files with extension .dpkg-dist or .ucf-dist in this directory dpkg: error processing package tex-common (--configure): subprocess installed post-installation script returned error exit status 1 ProblemType: Package DistroRelease: Ubuntu 14.04 Package: tex-common 4.04 Uname: Linux 3.11.0-19-generic x86_64 Architecture: amd64 Date: Wed Apr 9 10:19:44 2014 ErrorMessage: ErrorMessage: subprocess installed post-installation script returned error exit status 1 MarkForUpload: True PackageArchitecture: all SourcePackage: tex-common Title: package tex-common 4.04 failed to install/upgrade: ErrorMessage: subprocess installed post-installation script returned error exit status 1
2014-04-09 10:33:53 Jean-Baptiste Lallement attachment added updmap.CGJydbZz https://bugs.launchpad.net/ubuntu/+source/tex-common/+bug/1304972/+attachment/4076956/+files/updmap.CGJydbZz
2014-04-09 10:34:48 Jean-Baptiste Lallement description Precise AMD64 to Trusty upgrade with all of main installed. tex-common crashes with: Processing triggers for tex-common (4.04) ... Running updmap-sys. This may take some time... updmap-sys failed. Output has been stored in /tmp/updmap.CGJydbZz Please include this file if you report a bug. Sometimes, not accepting conffile updates in /etc/texmf/updmap.d causes updmap-sys to fail. Please check for files with extension .dpkg-dist or .ucf-dist in this directory dpkg: error processing package tex-common (--configure): subprocess installed post-installation script returned error exit status 1 ProblemType: Package DistroRelease: Ubuntu 14.04 Package: tex-common 4.04 Uname: Linux 3.11.0-19-generic x86_64 Architecture: amd64 Date: Wed Apr 9 10:19:44 2014 ErrorMessage: ErrorMessage: subprocess installed post-installation script returned error exit status 1 MarkForUpload: True PackageArchitecture: all SourcePackage: tex-common Title: package tex-common 4.04 failed to install/upgrade: ErrorMessage: subprocess installed post-installation script returned error exit status 1 Precise AMD64 to Trusty upgrade with all of main installed. tex-common crashes with: """ Processing triggers for tex-common (4.04) ... Running updmap-sys. This may take some time... updmap-sys failed. Output has been stored in /tmp/updmap.CGJydbZz Please include this file if you report a bug. Sometimes, not accepting conffile updates in /etc/texmf/updmap.d causes updmap-sys to fail. Please check for files with extension .dpkg-dist or .ucf-dist in this directory dpkg: error processing package tex-common (--configure):  subprocess installed post-installation script returned error exit status 1 """ Content of /tmp/updmap.CGJydbZz """ updmap is using the following updmap.cfg files (in precedence order): /var/lib/texmf/web2c/updmap.cfg /usr/share/texmf/web2c/updmap.cfg /usr/share/texlive/texmf-dist/web2c/updmap.cfg updmap is using the following updmap.cfg file for writing changes: /etc/texmf/web2c/updmap.cfg dvips output dir: "/var/lib/texmf/fonts/map/dvips/updmap" pdftex output dir: "/var/lib/texmf/fonts/map/pdftex/updmap" dvipdfmx output dir: "/var/lib/texmf/fonts/map/dvipdfmx/updmap" ERROR: The following map file(s) couldn't be found: antp.map (in /var/lib/texmf/web2c/updmap.cfg) comicvn.map (in /var/lib/texmf/web2c/updmap.cfg) csother.map (in /var/lib/texmf/web2c/updmap.cfg) cstext.map (in /var/lib/texmf/web2c/updmap.cfg) fi4.map (in /var/lib/texmf/web2c/updmap.cfg) grverb.map (in /var/lib/texmf/web2c/updmap.cfg) mscorevn.map (in /var/lib/texmf/web2c/updmap.cfg) slantcm.map (in /var/lib/texmf/web2c/updmap.cfg) troff-updmap.map (in /var/lib/texmf/web2c/updmap.cfg) zpeu.map (in /var/lib/texmf/web2c/updmap.cfg) Did you run mktexlsr? You can disable non-existent map entries using the option --syncwithtrees. """ ProblemType: Package DistroRelease: Ubuntu 14.04 Package: tex-common 4.04 Uname: Linux 3.11.0-19-generic x86_64 Architecture: amd64 Date: Wed Apr 9 10:19:44 2014 ErrorMessage: ErrorMessage: subprocess installed post-installation script returned error exit status 1 MarkForUpload: True PackageArchitecture: all SourcePackage: tex-common Title: package tex-common 4.04 failed to install/upgrade: ErrorMessage: subprocess installed post-installation script returned error exit status 1
2014-04-17 16:04:11 Brian Murray tags amd64 apport-package qa-manual-testing rls-t-incoming amd64 apport-package dist-upgrade precise2trusty qa-manual-testing rls-t-incoming
2014-04-17 20:30:16 Launchpad Janitor tex-common (Ubuntu): status New Confirmed
2014-04-17 20:53:54 Nate Eldredge bug added subscriber Nate Eldredge
2014-04-25 07:19:40 Jan Groenewald bug added subscriber AIMS
2014-06-04 12:48:41 Vladimir Dobriakov bug added subscriber Vladimir Dobriakov
2014-06-14 16:13:19 Metta Crawler marked as duplicate 1236951
2014-07-31 08:40:52 Stéphane Fillod bug added subscriber Stéphane Fillod
2014-08-15 02:02:48 BummelBaum bug added subscriber BummelBaum
2014-08-15 06:39:31 Torben Knudsen bug added subscriber Torben Knudsen
2014-08-15 08:05:44 Domingos86 bug added subscriber Domingos86
2014-08-20 19:43:54 Maurice Clerc bug added subscriber Maurice Clerc
2015-08-23 12:26:04 BummelBaum removed subscriber BummelBaum