termit version 2.6.0-1 failed to build on i386

Bug #803204 reported by Stefano Rivera on 2011-06-28
6
This bug affects 1 person
Affects Status Importance Assigned to Milestone
termit (Debian)
Fix Released
Unknown
termit (Ubuntu)
Medium
Unassigned

Bug Description

termit version 2.6.0-1 failed to build on i386
Link to failed build: https://launchpad.net/ubuntu/+source/termit/2.6.0-1/+build/2480977

Direct link to the build log: https://launchpad.net/ubuntu/+source/termit/2.6.0-1/+build/2480977/+files/buildlog_ubuntu-oneiric-i386.termit_2.6.0-1_FAILEDTOBUILD.txt.gz

This log snippet might be of interest, since it triggered the matcher 'Purging chroot-autobuild'.
Excerpt 2686 lines into the build log:

CMakeFiles/termit.dir/termit_preferences.c.o: In function `termit_preferences_dialog':
/build/buildd/termit-2.6.0/src/termit_preferences.c:270: undefined reference to `g_type_check_instance_cast'
/build/buildd/termit-2.6.0/src/termit_preferences.c:270: undefined reference to `gtk_entry_get_text'
/build/buildd/termit-2.6.0/src/termit_preferences.c:270: undefined reference to `gtk_label_get_type'
/build/buildd/termit-2.6.0/src/termit_preferences.c:270: undefined reference to `g_type_check_instance_cast'
/build/buildd/termit-2.6.0/src/termit_preferences.c:270: undefined reference to `gtk_label_get_text'
collect2: ld returned 1 exit status
make[3]: *** [src/termit] Error 1
make[3]: Leaving directory `/build/buildd/termit-2.6.0/obj-i686-linux-gnu'
make[2]: *** [src/CMakeFiles/termit.dir/all] Error 2
make[2]: Leaving directory `/build/buildd/termit-2.6.0/obj-i686-linux-gnu'
make[1]: *** [all] Error 2
make[1]: Leaving directory `/build/buildd/termit-2.6.0/obj-i686-linux-gnu'
make: *** [debian/stamp-makefile-build] Error 2
dpkg-buildpackage: error: debian/rules build gave error exit status 2
******************************************************************************
Build finished at 20110504-1556
FAILED [dpkg-buildpackage died]
Purging chroot-autobuild/build/buildd/termit-2.6.0

Related branches

Changed in termit (Ubuntu):
importance: Undecided → Medium
Julian Taylor (jtaylor) wrote :

patch available in debian bug

Changed in termit (Ubuntu):
status: New → Triaged
Changed in termit (Debian):
status: Unknown → New
Launchpad Janitor (janitor) wrote :

This bug was fixed in the package termit - 2.6.0-1ubuntu1

---------------
termit (2.6.0-1ubuntu1) oneiric; urgency=low

  * debian/patches/fix-as-needed-build.patch:
    - fix build with ld --as-needed (LP: #803204)
 -- Julian Taylor <email address hidden> Sun, 21 Aug 2011 17:00:06 +0200

Changed in termit (Ubuntu):
status: Triaged → Fix Released
Changed in termit (Debian):
status: New → Fix Released
To post a comment you must log in.
This report contains Public information  Edit
Everyone can see this information.

Other bug subscribers

Remote bug watches

Bug watches keep track of this bug in other bug trackers.