tenace version 0.11-1 failed to build on i386

Bug #803203 reported by Stefano Rivera on 2011-06-28
6
This bug affects 1 person
Affects Status Importance Assigned to Milestone
tenace (Debian)
Fix Released
Unknown
tenace (Ubuntu)
Medium
Unassigned

Bug Description

tenace version 0.11-1 failed to build on i386
Link to failed build: https://launchpad.net/ubuntu/+source/tenace/0.11-1/+build/2471597

Direct link to the build log: https://launchpad.net/ubuntu/+source/tenace/0.11-1/+build/2471597/+files/buildlog_ubuntu-oneiric-i386.tenace_0.11-1_FAILEDTOBUILD.txt.gz

This log snippet might be of interest, since it triggered the matcher 'Purging chroot-autobuild'.
Excerpt 1416 lines into the build log:

/usr/lib/libdds.a(dds.o): In function `SolveAllBoards4._omp_fn.0':
(.text+0xadf0): undefined reference to `GOMP_loop_end'
/usr/lib/libdds.a(dds.o): In function `SolveAllBoards4':
(.text+0xae80): undefined reference to `GOMP_parallel_start'
/usr/lib/libdds.a(dds.o): In function `SolveAllBoards4':
(.text+0xae8d): undefined reference to `GOMP_parallel_end'
collect2: ld returned 1 exit status
make[3]: *** [tenace] Error 1
make[3]: Leaving directory `/build/buildd/tenace-0.11/src'
make[2]: *** [all-recursive] Error 1
make[2]: Leaving directory `/build/buildd/tenace-0.11'
make[1]: *** [all] Error 2
make[1]: Leaving directory `/build/buildd/tenace-0.11'
make: *** [build-stamp] Error 2
dpkg-buildpackage: error: debian/rules build gave error exit status 2
******************************************************************************
Build finished at 20110502-1232
FAILED [dpkg-buildpackage died]
Purging chroot-autobuild/build/buildd/tenace-0.11

Related branches

Changed in tenace (Ubuntu):
importance: Undecided → Medium
Julian Taylor (jtaylor) on 2011-06-29
Changed in tenace (Ubuntu):
assignee: nobody → Julian Taylor (jtaylor)
status: New → In Progress
Julian Taylor (jtaylor) wrote :

patch available in debian bug

tags: added: patch-forwarded-debian
Changed in tenace (Debian):
status: Unknown → New
Julian Taylor (jtaylor) on 2011-08-21
Changed in tenace (Ubuntu):
assignee: Julian Taylor (jtaylor) → nobody
status: In Progress → Triaged
Launchpad Janitor (janitor) wrote :

This bug was fixed in the package tenace - 0.11-1ubuntu1

---------------
tenace (0.11-1ubuntu1) oneiric; urgency=low

  * patch src/Makefile.in to order libraries correctly
    - fix build with ld --as-needed (LP: #803203)
 -- Julian Taylor <email address hidden> Sun, 21 Aug 2011 16:52:52 +0200

Changed in tenace (Ubuntu):
status: Triaged → Fix Released
Changed in tenace (Debian):
status: New → Fix Released
To post a comment you must log in.
This report contains Public information  Edit
Everyone can see this information.

Other bug subscribers

Remote bug watches

Bug watches keep track of this bug in other bug trackers.