package initscripts 2.88dsf-13.10ubuntu11.1 failed to install/upgrade: ErrorMessage: Unterprozess installiertes post-installation-Skript gab den Fehlerwert 1 zurück

Bug #1036050 reported by Bruno Schneider on 2012-08-13
6
This bug affects 1 person
Affects Status Importance Assigned to Milestone
sysvinit (Ubuntu)
Undecided
Unassigned

Bug Description

installArchives() failed:
Extrahiere Vorlagen aus Paketen: 50%%
Extrahiere Vorlagen aus Paketen: 100%%
Vorkonfiguration der Pakete ...

Extrahiere Vorlagen aus Paketen: 50%%
Extrahiere Vorlagen aus Paketen: 100%%
Vorkonfiguration der Pakete ...

Extrahiere Vorlagen aus Paketen: 50%%
Extrahiere Vorlagen aus Paketen: 100%%
Vorkonfiguration der Pakete ...

Extrahiere Vorlagen aus Paketen: 50%%
Extrahiere Vorlagen aus Paketen: 100%%
Vorkonfiguration der Pakete ...
Setting up initscripts (2.88dsf-13.10ubuntu11.1) ...
update-rc.d: /etc/init.d/urandom: file does not exist
dpkg: error processing initscripts (--configure):
 subprocess installed post-installation script returned error exit status 1
Error in function:
Setting up initscripts (2.88dsf-13.10ubuntu11.1) ...
update-rc.d: /etc/init.d/urandom: file does not exist
dpkg: error processing initscripts (--configure):
 subprocess installed post-installation script returned error exit status 1
dpkg: dependency problems prevent configuration of resolvconf:
 resolvconf depends on initscripts (>= 2.88dsf-13.10); however:
  Package initscripts is not configured yet.
dpkg: error processing resolvconf (--configure):
 dependency problems - leaving unconfigured

ProblemType: Package
DistroRelease: Ubuntu 12.04
Package: initscripts 2.88dsf-13.10ubuntu11.1
ProcVersionSignature: Ubuntu 3.2.0-27.43-generic 3.2.21
Uname: Linux 3.2.0-27-generic x86_64
NonfreeKernelModules: nvidia
ApportVersion: 2.0.1-0ubuntu11
Architecture: amd64
Date: Sat Aug 11 09:38:12 2012
ErrorMessage: ErrorMessage: Unterprozess installiertes post-installation-Skript gab den Fehlerwert 1 zurück
InstallationMedia: Ubuntu 11.04 "Natty Narwhal" - Release amd64 (20110427)
SourcePackage: sysvinit
Title: package initscripts 2.88dsf-13.10ubuntu11.1 failed to install/upgrade: ErrorMessage: Unterprozess installiertes post-installation-Skript gab den Fehlerwert 1 zurück
UpgradeStatus: No upgrade log present (probably fresh install)

Bruno Schneider (dl7un) wrote :
To post a comment you must log in.
This report contains Public information  Edit
Everyone can see this information.

Other bug subscribers