sssd ftbfs

Bug #1780783 reported by Andreas Hasenack on 2018-07-09
8
This bug affects 1 person
Affects Status Importance Assigned to Milestone
sssd (Ubuntu)
High
Andreas Hasenack

Bug Description

cosmic 1.16.1-1ubuntu3

(...)
dh_install
dh_install: Cannot find (any matches for) "usr/local/lib/python3*/*-packages/pyhbac.so" (tried in ., debian/tmp)

dh_install: python3-libipa-hbac missing files: usr/local/lib/python3*/*-packages/pyhbac.so
dh_install: Cannot find (any matches for) "usr/local/lib/python3*/*-packages/pysss_nss_idmap.so" (tried in ., debian/tmp)

dh_install: python3-libsss-nss-idmap missing files: usr/local/lib/python3*/*-packages/pysss_nss_idmap.so
dh_install: Cannot find (any matches for) "usr/local/lib/python3*/*-packages/pysss.so" (tried in ., debian/tmp)

dh_install: python3-sss missing files: usr/local/lib/python3*/*-packages/pysss.so
dh_install: Cannot find (any matches for) "usr/local/lib/python3*/*-packages/pysss_murmur.so" (tried in ., debian/tmp)

dh_install: python3-sss missing files: usr/local/lib/python3*/*-packages/pysss_murmur.so
dh_install: missing files, aborting
debian/rules:55: recipe for target 'override_dh_install' failed
make[1]: *** [override_dh_install] Error 25
make[1]: Leaving directory '/home/ubuntu/sssd-1.16.1'
debian/rules:3: recipe for target 'binary' failed
make: *** [binary] Error 2
dpkg-buildpackage: error: fakeroot debian/rules binary subprocess returned exit status 2

Related branches

tags: added: ftbfs
Changed in sssd (Ubuntu):
status: New → Triaged
importance: Undecided → High
tags: added: bite
tags: added: bitesize
removed: bite
Changed in sssd (Ubuntu):
assignee: nobody → Andreas Hasenack (ahasenack)
status: Triaged → In Progress
Launchpad Janitor (janitor) wrote :

This bug was fixed in the package sssd - 1.16.1-1ubuntu4

---------------
sssd (1.16.1-1ubuntu4) cosmic; urgency=medium

  * d/p/python3-libipa-hbac.install, d/p/python3-libsss-nss-idmap.install,
    d/p/python3-sss.install: modules go in /usr/lib/python3*, not
    /usr/local/lib/python3* (LP: #1780783)
  * d/sssd-common.sssd.init: drop initscript that was accidentally added
    in 1.16.1-1ubuntu3.

 -- Andreas Hasenack <email address hidden> Tue, 10 Jul 2018 17:21:22 -0300

Changed in sssd (Ubuntu):
status: In Progress → Fix Released
To post a comment you must log in.
This report contains Public information  Edit
Everyone can see this information.

Other bug subscribers