sslsniff version 0.7-1 failed to build on i386

Bug #803200 reported by Stefano Rivera on 2011-06-28
6
This bug affects 1 person
Affects Status Importance Assigned to Milestone
sslsniff (Debian)
Fix Released
Unknown
sslsniff (Ubuntu)
Medium
Unassigned

Bug Description

sslsniff version 0.7-1 failed to build on i386
Link to failed build: https://launchpad.net/ubuntu/+source/sslsniff/0.7-1/+build/2514414

Direct link to the build log: https://launchpad.net/ubuntu/+source/sslsniff/0.7-1/+build/2514414/+files/buildlog_ubuntu-oneiric-i386.sslsniff_0.7-1_FAILEDTOBUILD.txt.gz

This log snippet might be of interest, since it triggered the matcher 'Purging chroot-autobuild'.
Excerpt 946 lines into the build log:

/usr/include/boost/asio/error.hpp:220: undefined reference to `boost::system::system_category()'
FirefoxAddonUpdater.o: In function `FirefoxAddonUpdater::sendMetaUpdateResponse()':
/build/buildd/sslsniff-0.7/FirefoxAddonUpdater.cpp:104: undefined reference to `SSL_write'
/build/buildd/sslsniff-0.7/FirefoxAddonUpdater.cpp:105: undefined reference to `SSL_write'
FirefoxAddonUpdater.o: In function `__static_initialization_and_destruction_0':
/usr/include/boost/system/error_code.hpp:214: undefined reference to `boost::system::generic_category()'
/usr/include/boost/system/error_code.hpp:215: undefined reference to `boost::system::generic_category()'
/usr/include/boost/system/error_code.hpp:216: undefined reference to `boost::system::system_category()'
FirefoxAddonUpdater.o: In function `get_system_category':
/usr/include/boost/asio/error.hpp:220: undefined reference to `boost::system::system_category()'
collect2: ld returned 1 exit status
make[1]: *** [sslsniff] Error 1
make[1]: Leaving directory `/build/buildd/sslsniff-0.7'
make: *** [build-stamp] Error 2
dpkg-buildpackage: error: debian/rules build gave error exit status 2
******************************************************************************
Build finished at 20110519-1546
FAILED [dpkg-buildpackage died]
Purging chroot-autobuild/build/buildd/sslsniff-0.7

Related branches

Changed in sslsniff (Ubuntu):
importance: Undecided → Medium
Julian Taylor (jtaylor) on 2011-06-29
Changed in sslsniff (Ubuntu):
status: New → In Progress
assignee: nobody → Julian Taylor (jtaylor)
Julian Taylor (jtaylor) wrote :

patch available in the debian bug

tags: added: patch-forwarded-debian
Changed in sslsniff (Ubuntu):
assignee: Julian Taylor (jtaylor) → nobody
Changed in sslsniff (Ubuntu):
status: In Progress → Triaged
Changed in sslsniff (Debian):
status: Unknown → Confirmed
Launchpad Janitor (janitor) wrote :

This bug was fixed in the package sslsniff - 0.7-1ubuntu1

---------------
sslsniff (0.7-1ubuntu1) oneiric; urgency=low

  * debian/control: pass libraries to link with in LIBS instead of LD_FLAGS
    - fixes build with ld --as-needed (LP: #803200)
 -- Julian Taylor <email address hidden> Sun, 21 Aug 2011 16:42:27 +0200

Changed in sslsniff (Ubuntu):
status: Triaged → Fix Released
Changed in sslsniff (Debian):
status: Confirmed → Fix Released
To post a comment you must log in.
This report contains Public information  Edit
Everyone can see this information.

Other bug subscribers

Remote bug watches

Bug watches keep track of this bug in other bug trackers.