Errors were encountered while processing: software-center

Bug #497157 reported by felixvah on 2009-12-15
12
This bug affects 2 people
Affects Status Importance Assigned to Milestone
software-center (Ubuntu)
Low
Unassigned

Bug Description

Binary package hint: software-center

when upgrade this is what I get:

Reading package lists... Done
Building dependency tree
Reading state information... Done
0 upgraded, 0 newly installed, 0 to remove and 0 not upgraded.
1 not fully installed or removed.
After this operation, 0B of additional disk space will be used.
Do you want to continue [Y/n]? y
Setting up software-center (1.0.2) ...
file does not exist: /usr/share/software-center/softwarecenter/__init__.py
file does not exist: /usr/share/software-center/softwarecenter/apt/__init__.py
file does not exist: /usr/share/software-center/softwarecenter/db/__init__.py
file does not exist: /usr/share/software-center/softwarecenter/view/__init__.py
file does not exist: /usr/share/software-center/softwarecenter/view/widgets/__init__.py
pycentral: pycentral pkginstall: error byte-compiling files (36)
pycentral pkginstall: error byte-compiling files (36)
dpkg: error processing software-center (--configure):
 subprocess installed post-installation script returned error exit status 1
Errors were encountered while processing:
 software-center
E: Sub-process /usr/bin/dpkg returned an error code (1)

ProblemType: Package
AptOrdering: software-center: Configure
Architecture: i386
Date: Tue Dec 15 12:43:23 2009
DistroRelease: Ubuntu 9.10
ErrorMessage: subprocess installed post-installation script returned error exit status 1
Package: software-center 1.0.2
PackageArchitecture: all
ProcVersionSignature: Ubuntu 2.6.31-16.53-generic
SourcePackage: software-center
Title: package software-center 1.0.2 failed to install/upgrade: subprocess installed post-installation script returned error exit status 1
Uname: Linux 2.6.31-16-generic i686

felixvah (felixvang) wrote :
Omer Akram (om26er) wrote :

seems like an issue with package upgrade. anyways is the problem still there?

Changed in software-center (Ubuntu):
status: New → Incomplete
Omer Akram (om26er) wrote :

We are closing this bug report because it lacks the information we need to investigate the problem, as described in the previous comments. Please reopen it if you can give us the missing information, and don't hesitate to submit bug reports in the future. To reopen the bug report you can click on the current status, under the Status column, and change the Status back to "New". Thanks again!

Changed in software-center (Ubuntu):
importance: Undecided → Low
status: Incomplete → Invalid
To post a comment you must log in.
This report contains Public information  Edit
Everyone can see this information.

Other bug subscribers