gutsy/amd64: ftbfs / autopkgtest failure

Bug #128224 reported by Ian Jackson on 2007-07-25
8
Affects Status Importance Assigned to Milestone
screem
Fix Released
Wishlist
Nominated for Head by Hazim Gazov
screem (Ubuntu)
High
Ubuntu Desktop Bugs

Bug Description

-----BEGIN PGP SIGNED MESSAGE-----
Hash: SHA1

 affects /ubuntu/screem

An instance of autopkgtest (an automatic package testing system) has
found that this package either failed to build from source - or that
it declared some tests in its debian/tests/control and that at least
one of these tests failed.

A human has briefly looked at the transcript and concluded that the
fault is a bug in the package or one of its build-dependencies.

The test environment is an amd64 Xen guest with limited amounts of
memory. The relevant dependencies are installed for each test but
very few other packages.

The top and bottom of the mail sent by the autopkgtest instance to its
administrator is included below. The full log can be found at
 http://autopkgtest.ubuntu.com/autopkgtest-output/gutsy/screem/

| Test executed for: gutsy source screem
| Outcome: erroneous package!
| blame: arg:tmp/screem/src/screem_0.16.1-4.1.dsc dsc:screem
| badpkg: rules build failed with exit code 2
| quitting: erroneous package: rules build failed with exit code 2
|
| erroneous package!
...
| gdl-dock-item-grip.c:238: error: 'GdlDockItemGripPrivate' has no member named 'title'
| gdl-dock-item-grip.c:240: error: 'GdlDockItemGripPrivate' has no member named 'icon_pixbuf'
| gdl-dock-item-grip.c:241: error: 'GdlDockItemGripPrivate' has no member named 'icon_pixbuf'
| gdl-dock-item-grip.c:242: error: 'GdlDockItemGripPrivate' has no member named 'icon_pixbuf'
| gdl-dock-item-grip.c:245: error: 'GdlDockItemGripPrivate' has no member named 'tooltips'
| gdl-dock-item-grip.c:246: error: 'GdlDockItemGripPrivate' has no member named 'tooltips'
| gdl-dock-item-grip.c:247: error: 'GdlDockItemGripPrivate' has no member named 'tooltips'
| gdl-dock-item-grip.c: In function 'gdl_dock_item_grip_instance_init':
| gdl-dock-item-grip.c:331: error: 'GdlDockItemGripPrivate' has no member named 'icon_pixbuf_valid'
| gdl-dock-item-grip.c:332: error: 'GdlDockItemGripPrivate' has no member named 'icon_pixbuf'
| gdl-dock-item-grip.c:333: error: 'GdlDockItemGripPrivate' has no member named 'title_layout'
| gdl-dock-item-grip.c:367: error: 'GdlDockItemGripPrivate' has no member named 'tooltips'
| gdl-dock-item-grip.c:367: warning: implicit declaration of function 'gtk_tooltips_new'
| gdl-dock-item-grip.c:368: error: 'GdlDockItemGripPrivate' has no member named 'tooltips'
| gdl-dock-item-grip.c:369: warning: implicit declaration of function 'gtk_object_sink'
| gdl-dock-item-grip.c:369: error: 'GdlDockItemGripPrivate' has no member named 'tooltips'
| gdl-dock-item-grip.c:370: warning: implicit declaration of function 'gtk_tooltips_set_tip'
| gdl-dock-item-grip.c:370: error: 'GdlDockItemGripPrivate' has no member named 'tooltips'
| gdl-dock-item-grip.c:372: error: 'GdlDockItemGripPrivate' has no member named 'tooltips'
| gdl-dock-item-grip.c: In function 'gdl_dock_item_grip_size_request':
| gdl-dock-item-grip.c:479: error: 'GdlDockItemGripPrivate' has no member named 'title_layout'
| gdl-dock-item-grip.c:493: error: 'GdlDockItemGripPrivate' has no member named 'icon_pixbuf'
| gdl-dock-item-grip.c:494: error: 'GdlDockItemGripPrivate' has no member named 'icon_pixbuf'
| gdl-dock-item-grip.c: In function 'gdl_dock_item_grip_size_allocate':
| gdl-dock-item-grip.c:596: error: 'GdlDockItemGripPrivate' has no member named 'title_layout'
| gdl-dock-item-grip.c:596: error: 'GdlDockItemGripPrivate' has no member named 'title'
| gdl-dock-item-grip.c:603: error: 'GdlDockItemGripPrivate' has no member named 'icon_pixbuf'
| gdl-dock-item-grip.c:604: error: 'GdlDockItemGripPrivate' has no member named 'icon_pixbuf'
| gdl-dock-item-grip.c:607: error: 'GdlDockItemGripPrivate' has no member named 'title_layout'
| make[4]: *** [gdl-dock-item-grip.lo] Error 1
| make[4]: Leaving directory `/root/adt-downtmp/dsc0-build/screem-0.16.1/gdl'
| make[3]: *** [all] Error 2
| make[3]: Leaving directory `/root/adt-downtmp/dsc0-build/screem-0.16.1/gdl'
| make[2]: *** [all-recursive] Error 1
| make[2]: Leaving directory `/root/adt-downtmp/dsc0-build/screem-0.16.1'
| make[1]: *** [all] Error 2
| make[1]: Leaving directory `/root/adt-downtmp/dsc0-build/screem-0.16.1'
| make: *** [debian/stamp-makefile-build] Error 2
| blame: arg:tmp/screem/src/screem_0.16.1-4.1.dsc dsc:screem
| badpkg: rules build failed with exit code 2
| adt-run: erroneous package: rules build failed with exit code 2
| adt-run: trace: ** stop
| adt-run: trace: ** close, scratch=tb-scratch~/root/adt-downtmp:-/|/root/adt-downtmp/!
| ++++++ RESULTS erroneous package! ++++++
| ++++++ bundling ++++++
| ++++++ uploading ++++++
| ++++++ contacting maintainer_email_override ++++++
| ++++++ tested. ++++++
|
|
-----BEGIN PGP SIGNATURE-----
Version: GnuPG v1.4.1 (GNU/Linux)

iD8DBQFGpyR805QTisYqw/QRAtgyAKChsF2atsSW5jCNtJN0ShOY7J204QCdHRHq
gTmf7otB2HC/v8QW1eCXoT8=
=3Gwj
-----END PGP SIGNATURE-----

Related branches

Luca Falavigna (dktrkranz) wrote :

Attached patch fixes this error, but this bug requires additional love to be fixed:

screem-dropdown-action.c:169: error: expected declaration specifiers or '...' before 'GtkTooltips'
screem-dropdown-action.c: In function 'set_tooltip_cb':
screem-dropdown-action.c:174: warning: implicit declaration of function 'gtk_menu_tool_button_set_arrow_tooltip'
screem-dropdown-action.c:174: error: 'tooltips' undeclared (first use in this function)
screem-dropdown-action.c:174: error: (Each undeclared identifier is reported only once
screem-dropdown-action.c:174: error: for each function it appears in.)
make[4]: *** [screem-dropdown-action.o] Error 1
make[4]: Leaving directory `/tmp/buildd/screem-0.16.1/src'
make[3]: *** [all] Error 2
make[3]: Leaving directory `/tmp/buildd/screem-0.16.1/src'
make[2]: *** [all-recursive] Error 1
make[2]: Leaving directory `/tmp/buildd/screem-0.16.1'
make[1]: *** [all] Error 2
make[1]: Leaving directory `/tmp/buildd/screem-0.16.1'
make: *** [debian/stamp-makefile-build] Error 2
pbuilder: Failed autobuilding of package

Changed in screem:
status: New → Confirmed
Changed in screem:
status: Unknown → Confirmed
Matthias Klose (doko) on 2007-08-24
Changed in screem:
importance: Undecided → High
Henrik Nilsen Omma (henrik) wrote :

Assigning based on last upload.

Changed in screem:
assignee: nobody → doko
Matthias Klose (doko) wrote :

Reassign to desktop bugs, gtk breakage

Changed in screem:
assignee: doko → desktop-bugs
Henrik Nilsen Omma (henrik) wrote :

Moving milestone to beta.

Sebastien Bacher (seb128) wrote :

I've uploaded a fixed revision

Changed in screem:
status: Confirmed → Fix Committed
Sebastien Bacher (seb128) wrote :

screem (0.16.1-4.1ubuntu1) gutsy; urgency=low

  * debian/patches/01_unset_gtk_deprecated_fix_build.patch:
    - don't disable gtk deprecateds to fix the build (LP: #128224)
  * debian/control: set ubuntu maintainer

 -- Sebastien Bacher <email address hidden> Thu, 27 Sep 2007 14:05:49 +0200

Changed in screem:
status: Fix Committed → Fix Released
Changed in screem:
status: Confirmed → Fix Released
Changed in screem:
importance: Unknown → Wishlist
To post a comment you must log in.
This report contains Public information  Edit
Everyone can see this information.

Duplicates of this bug

Other bug subscribers

Remote bug watches

Bug watches keep track of this bug in other bug trackers.