salome version 5.1.3-12ubuntu1 failed to build in oneiric

Bug #832937 reported by Matthias Klose on 2011-08-24
6
This bug affects 1 person
Affects Status Importance Assigned to Milestone
salome (Ubuntu)
High
Unassigned
Oneiric
High
Unassigned

Bug Description

salome version 5.1.3-12ubuntu1 failed to build in oneiric
Link to failed build: https://launchpad.net/ubuntu/+archive/test-rebuild-20110816/+build/2710912

Details about the rebuild:
http://people.ubuntuwire.org/~wgrant/rebuild-ftbfs-test/test-rebuild-20110816-oneiric.html

Direct link to the build log: https://launchpad.net/ubuntu/+archive/test-rebuild-20110816/+build/2710912/+files/buildlog_ubuntu-oneiric-amd64.salome_5.1.3-12ubuntu1_FAILEDTOBUILD.txt.gz

This log snippet might be of interest, since it triggered the matcher 'Purging chroot-autobuild'.
Excerpt 4344 lines into the build log:

libtool: link: ( cd ".libs" && rm -f "libSalomeLoggerServer.la" && ln -s "../libSalomeLoggerServer.la" "libSalomeLoggerServer.la" )
/bin/bash ../../libtool --tag=CXX --mode=link g++ -I../../salome_adm/unix -include SALOMEconfig.h -D_OCC64 -g -O2 -g -Wparentheses -Wreturn-type -Wmissing-declarations -Wunused -pthread -Wl,-Bsymbolic-functions -Xlinker -enable-new-dtags -o SALOME_Logger_Server SALOME_Logger_Server-SALOME_Logger_Server_main.o libSalomeLoggerServer.la -lnsl -lm -lrt -ldl
libtool: link: g++ -I../../salome_adm/unix -include SALOMEconfig.h -D_OCC64 -g -O2 -g -Wparentheses -Wreturn-type -Wmissing-declarations -Wunused -pthread -Wl,-Bsymbolic-functions -Wl,-enable-new-dtags -o .libs/SALOME_Logger_Server SALOME_Logger_Server-SALOME_Logger_Server_main.o ./.libs/libSalomeLoggerServer.so -lnsl -lm -lrt -ldl -pthread -Wl,-rpath -Wl,/usr/lib/salome/lib
/usr/bin/ld: SALOME_Logger_Server-SALOME_Logger_Server_main.o: undefined reference to symbol 'SALOME_Logger::Logger_Helper::_nil()'
/usr/bin/ld: note: 'SALOME_Logger::Logger_Helper::_nil()' is defined in DSO /build/buildd/salome-5.1.3/build-salome/KERNEL_SRC_5.1.3/idl/.libs/libSalomeIDLKernel.so.0 so try adding it to the linker command line
/build/buildd/salome-5.1.3/build-salome/KERNEL_SRC_5.1.3/idl/.libs/libSalomeIDLKernel.so.0: could not read symbols: Invalid operation
collect2: ld returned 1 exit status
make[3]: *** [SALOME_Logger_Server] Error 1
make[3]: Leaving directory `/build/buildd/salome-5.1.3/build-salome/KERNEL_SRC_5.1.3/src/Logger'
make[2]: *** [all-recursive] Error 1
make[2]: Leaving directory `/build/buildd/salome-5.1.3/build-salome/KERNEL_SRC_5.1.3/src'
make[1]: *** [all-recursive] Error 1
make[1]: Leaving directory `/build/buildd/salome-5.1.3/build-salome/KERNEL_SRC_5.1.3'
make: *** [build-arch-stamp] Error 2
dpkg-buildpackage: error: debian/rules build gave error exit status 2
******************************************************************************
Build finished at 20110823-0825
FAILED [dpkg-buildpackage died]
Purging chroot-autobuild/build/buildd/salome-5.1.3

Matthias Klose (doko) on 2011-08-24
Changed in salome (Ubuntu):
status: New → Confirmed
importance: Undecided → High
Matthias Klose (doko) wrote :

please lets remove this package; there have been too many efforts to get it buildable, but neither debian nor upstream do respond to questions or patches. It should be enough to remove the binaries, and keep the source and the build failures as a reminder.

tags: added: nbs
Colin Watson (cjwatson) wrote :

2011-09-02 23:57:15 INFO Creating lockfile: /var/lock/launchpad-lp-remove-package.lock
2011-09-02 23:57:25 INFO Removing candidates:
2011-09-02 23:57:25 INFO salome 5.1.3-12ubuntu1 in oneiric amd64
2011-09-02 23:57:25 INFO salome 5.1.3-12ubuntu1 in oneiric i386
2011-09-02 23:57:25 INFO salome 5.1.3-12ubuntu1 in oneiric powerpc
2011-09-02 23:57:25 INFO salome-common 5.1.3-12ubuntu1 in oneiric amd64
2011-09-02 23:57:25 INFO salome-common 5.1.3-12ubuntu1 in oneiric armel
2011-09-02 23:57:25 INFO salome-common 5.1.3-12ubuntu1 in oneiric i386
2011-09-02 23:57:25 INFO salome-common 5.1.3-12ubuntu1 in oneiric powerpc
2011-09-02 23:57:25 INFO salome-dev 5.1.3-12ubuntu1 in oneiric amd64
2011-09-02 23:57:25 INFO salome-dev 5.1.3-12ubuntu1 in oneiric i386
2011-09-02 23:57:25 INFO salome-dev 5.1.3-12ubuntu1 in oneiric powerpc
2011-09-02 23:57:25 INFO salome-doc 5.1.3-12ubuntu1 in oneiric amd64
2011-09-02 23:57:25 INFO salome-doc 5.1.3-12ubuntu1 in oneiric armel
2011-09-02 23:57:25 INFO salome-doc 5.1.3-12ubuntu1 in oneiric i386
2011-09-02 23:57:25 INFO salome-doc 5.1.3-12ubuntu1 in oneiric powerpc
2011-09-02 23:57:25 INFO salome-examples 5.1.3-12ubuntu1 in oneiric amd64
2011-09-02 23:57:25 INFO salome-examples 5.1.3-12ubuntu1 in oneiric i386
2011-09-02 23:57:25 INFO salome-examples 5.1.3-12ubuntu1 in oneiric powerpc
2011-09-02 23:57:25 INFO salome-examples-common 5.1.3-12ubuntu1 in oneiric amd64
2011-09-02 23:57:25 INFO salome-examples-common 5.1.3-12ubuntu1 in oneiric armel
2011-09-02 23:57:25 INFO salome-examples-common 5.1.3-12ubuntu1 in oneiric i386
2011-09-02 23:57:25 INFO salome-examples-common 5.1.3-12ubuntu1 in oneiric powerpc
2011-09-02 23:57:25 INFO salome-extras 5.1.3-12ubuntu1 in oneiric amd64
2011-09-02 23:57:25 INFO salome-extras 5.1.3-12ubuntu1 in oneiric i386
2011-09-02 23:57:25 INFO salome-extras 5.1.3-12ubuntu1 in oneiric powerpc
2011-09-02 23:57:25 INFO salome-test 5.1.3-12ubuntu1 in oneiric amd64
2011-09-02 23:57:25 INFO salome-test 5.1.3-12ubuntu1 in oneiric i386
2011-09-02 23:57:25 INFO salome-test 5.1.3-12ubuntu1 in oneiric powerpc
2011-09-02 23:57:25 INFO Removed-by: Colin Watson
2011-09-02 23:57:25 INFO Comment: requested by doko; extremely hard to get to build any more, no response from Debian or upstream to questions or patches, depends on many NBS libraries; LP: #832937
2011-09-02 23:57:25 INFO 27 packages successfully removed.
Confirm this transaction? [yes, no] yes
2011-09-02 23:57:31 INFO Transaction committed.
2011-09-02 23:57:31 INFO The archive will be updated in the next publishing cycle.

Colin Watson (cjwatson) wrote :

Unsubscribing ubuntu-archive since the removal is done; leaving the bug open though since the source is still in the archive and it still fails to build.

tags: removed: nbs
Matthias Klose (doko) wrote :

2011-09-20 22:45:51 INFO Removing candidates:
2011-09-20 22:45:51 INFO salome 5.1.3-12ubuntu2 in oneiric
2011-09-20 22:45:51 INFO Removed-by: Matthias Klose
2011-09-20 22:45:51 INFO Comment: FTFBS in oneiric, see LP: #832937, several Debian RC reports, removed in testing and stable
2011-09-20 22:45:52 INFO 1 package successfully removed.

Changed in salome (Ubuntu Oneiric):
status: Confirmed → Won't Fix
Changed in salome (Ubuntu):
status: Confirmed → Won't Fix
To post a comment you must log in.
This report contains Public information  Edit
Everyone can see this information.

Other bug subscribers