rhythmbox ftbfs in raring

Bug #1163801 reported by Matthias Klose on 2013-04-03
10
This bug affects 2 people
Affects Status Importance Assigned to Milestone
rhythmbox (Ubuntu)
High
Jeremy Bicha
Raring
High
Jeremy Bicha

Bug Description

see https://launchpad.net/ubuntu/+archive/test-rebuild-20130329/+build/4443119

error building the docs

See rhythmbox-undeclared.txt for the list of undeclared symbols.
./rhythmbox-unused.txt:1: warning: 797 unused declarations.They should be added to rhythmbox-sections.txt in the appropriate place.
  DOC Building HTML
../xml/rhythmdb.xml:264: element refsect2: validity error : ID RhythmDBQuery already defined
<refsect2 id="RhythmDBQuery" role="typedef">
                                           ^
warning: failed to load external entity "../xml/rb-plugin.xml"
../rhythmbox-docs.sgml:52: element include: XInclude error : could not load ../xml/rb-plugin.xml, and no fallback was found
warning: failed to load external entity "../xml/rb-display-page.xml"
../rhythmbox-docs.sgml:68: element include: XInclude error : could not load ../xml/rb-display-page.xml, and no fallback was found
warning: failed to load external entity "../xml/rb-display-page-group.xml"
../rhythmbox-docs.sgml:69: element include: XInclude error : could not load ../xml/rb-display-page-group.xml, and no fallback was found
warning: failed to load external entity "../xml/rb-display-page-model.xml"
../rhythmbox-docs.sgml:70: element include: XInclude error : could not load ../xml/rb-display-page-model.xml, and no fallback was found
warning: failed to load external entity "../xml/rb-display-page-tree.xml"
../rhythmbox-docs.sgml:71: element include: XInclude error : could not load ../xml/rb-display-page-tree.xml, and no fallback was found
make[4]: *** [html-build.stamp] Error 6
make[4]: Leaving directory `/build/buildd/rhythmbox-2.98/doc/reference'
make[3]: *** [all-recursive] Error 1
make[3]: Leaving directory `/build/buildd/rhythmbox-2.98/doc'
make[2]: *** [all-recursive] Error 1
make[2]: Leaving directory `/build/buildd/rhythmbox-2.98'
make[1]: *** [all] Error 2
make[1]: Leaving directory `/build/buildd/rhythmbox-2.98'
make: *** [debian/stamp-makefile-build] Error 2
dpkg-buildpackage: error: debian/rules build gave error exit status 2

Matthias Klose (doko) on 2013-04-08
Changed in rhythmbox (Ubuntu Raring):
milestone: ubuntu-13.04-beta-1 → ubuntu-13.04
Jeremy Bicha (jbicha) on 2013-04-09
Changed in rhythmbox (Ubuntu Raring):
assignee: nobody → Jeremy Bicha (jbicha)
status: Confirmed → In Progress
Launchpad Janitor (janitor) wrote :

This bug was fixed in the package rhythmbox - 2.98-0ubuntu4

---------------
rhythmbox (2.98-0ubuntu4) raring; urgency=low

  * debian/patches/git-fix-doc-build.patch:
    Backport git patch to fix build failure (LP: #1163801)
 -- Jeremy Bicha <email address hidden> Mon, 08 Apr 2013 23:34:33 -0400

Changed in rhythmbox (Ubuntu Raring):
status: In Progress → Fix Released
To post a comment you must log in.
This report contains Public information  Edit
Everyone can see this information.

Other bug subscribers