Comment 5 for bug 1077116

Alexander (alexander-mezon) wrote :

Same for me

make[2]: Entering directory `/builddir/build/BUILD/kdelibs-4.10.5/build'

cd /builddir/build/BUILD/kdelibs-4.10.5/build/kdeui && /usr/bin/automoc4 /builddir/build/BUILD/kdelibs-4.10.5/build/kdeui/kdeui_automoc.cpp /builddir/build/BUILD/kdelibs-4.10.5/kdeui /builddir/build/BUILD/kdelibs-4.10.5/build/kdeui /usr/lib/qt4/bin/moc /usr/bin/cmake

Unable to load library icui18n "Cannot load library icui18n: (icui18n: cannot open shared object file: No such file or directory)"

qemu: uncaught target signal 11 (Segmentation fault) - core dumped

/bin/sh: line 1: 8056 Segmentation fault (core dumped) /usr/bin/automoc4 /builddir/build/BUILD/kdelibs-4.10.5/build/kdeui/kdeui_automoc.cpp /builddir/build/BUILD/kdelibs-4.10.5/kdeui /builddir/build/BUILD/kdelibs-4.10.5/build/kdeui /usr/lib/qt4/bin/moc /usr/bin/cmake

make[2]: *** [kdeui/CMakeFiles/kdeui_automoc] Error 139

make[2]: Leaving directory `/builddir/build/BUILD/kdelibs-4.10.5/build'

make[1]: *** [kdeui/CMakeFiles/kdeui_automoc.dir/all] Error 2

make[1]: Leaving directory `/builddir/build/BUILD/kdelibs-4.10.5/build'

make: *** [all] Error 2

make: Leaving directory `/builddir/build/BUILD/kdelibs-4.10.5/build'

error: Bad exit status from /var/tmp/rpm-tmp.50015 (%install)

RPM build errors:

    Bad exit status from /var/tmp/rpm-tmp.50015 (%install)