python-greenlet fails to build in trusty with updated python 2.7.9

Bug #1451537 reported by Matthias Klose on 2015-05-04
8
This bug affects 1 person
Affects Status Importance Assigned to Milestone
python-greenlet (Ubuntu)
High
Unassigned
Trusty
Undecided
Unassigned

Bug Description

seen in a test rebuild with python 2.7.9 in trusty
https://launchpad.net/ubuntu/+archive/test-rebuild-20150317/+build/7080478

======================================================================
FAIL: test_threaded_leak (tests.test_leaks.ArgRefcountTests)
----------------------------------------------------------------------
Traceback (most recent call last):
  File "/build/buildd/python-greenlet-0.4.2/tests/test_leaks.py", line 43, in test_threaded_leak
    self.assertTrue(g() is None)
AssertionError: False is not true

----------------------------------------------------------------------
Ran 61 tests in 0.380s

FAILED (failures=1)
make[1]: *** [test-2.7-stamp] Error 1
make[1]: Leaving directory `/build/buildd/python-greenlet-0.4.2'
make: *** [build] Error 2

fixed by backporting the test_leaks changes from 0.4.9. Also seen without the python2.7 update.

acceptance criteria: package succeeds to build.

Matthias Klose (doko) on 2015-10-02
description: updated

Hello Matthias, or anyone else affected,

Accepted python-greenlet into trusty-proposed. The package will build now and be available at https://launchpad.net/ubuntu/+source/python-greenlet/0.4.2-1ubuntu0.1 in a few hours, and then in the -proposed repository.

Please help us by testing this new package. See https://wiki.ubuntu.com/Testing/EnableProposed for documentation how to enable and use -proposed. Your feedback will aid us getting this update out to other Ubuntu users.

If this package fixes the bug for you, please add a comment to this bug, mentioning the version of the package you tested, and change the tag from verification-needed to verification-done. If it does not fix the bug for you, please add a comment stating that, and change the tag to verification-failed. In either case, details of your testing will help us make a better decision.

Further information regarding the verification process can be found at https://wiki.ubuntu.com/QATeam/PerformingSRUVerification . Thank you in advance!

Changed in python-greenlet (Ubuntu):
status: Confirmed → Triaged
status: Triaged → Fix Released
Changed in python-greenlet (Ubuntu Trusty):
status: New → Fix Committed
tags: added: verification-needed
Matthias Klose (doko) wrote :

the package built and passes the tests on all architectures.

tags: added: verification-done
removed: verification-needed
Launchpad Janitor (janitor) wrote :

This bug was fixed in the package python-greenlet - 0.4.2-1ubuntu0.1

---------------
python-greenlet (0.4.2-1ubuntu0.1) trusty-proposed; urgency=medium

  * SRU: LP: #1451537.
  * Backport the test_leaks changes from 0.4.9.

 -- Matthias Klose <email address hidden> Fri, 02 Oct 2015 15:31:53 +0200

Changed in python-greenlet (Ubuntu Trusty):
status: Fix Committed → Fix Released

The verification of the Stable Release Update for python-greenlet has completed successfully and the package has now been released to -updates. Subsequently, the Ubuntu Stable Release Updates Team is being unsubscribed and will not receive messages about this bug report. In the event that you encounter a regression using the package from -updates please report a new bug using ubuntu-bug and tag the bug report regression-update so we can easily find any regressions.

To post a comment you must log in.
This report contains Public information  Edit
Everyone can see this information.

Other bug subscribers