pyacidobasic version 1.0-3 failed to build in oneiric

Bug #835001 reported by Matthias Klose
6
This bug affects 1 person
Affects Status Importance Assigned to Milestone
pyacidobasic (Ubuntu)
Fix Released
High
Unassigned
Oneiric
Fix Released
High
Unassigned

Bug Description

pyacidobasic version 1.0-3 failed to build in oneiric
Link to failed build: https://launchpad.net/ubuntu/+archive/test-rebuild-20110816/+build/2708953

Details about the rebuild:
http://people.ubuntuwire.org/~wgrant/rebuild-ftbfs-test/test-rebuild-20110816-oneiric.html

Direct link to the build log: https://launchpad.net/ubuntu/+archive/test-rebuild-20110816/+build/2708953/+files/buildlog_ubuntu-oneiric-i386.pyacidobasic_1.0-3_FAILEDTOBUILD.txt.gz

This log snippet might be of interest, since it triggered the matcher 'Purging chroot-autobuild'.
Excerpt 887 lines into the build log:

debian/python-acidobasic/usr/lib/python2.7/site-packages/pyacidobasic/Ui_main.py
debian/python-acidobasic/usr/lib/python2.7/site-packages/pyacidobasic/curveControl.pyc
debian/python-acidobasic/usr/lib/python2.7/site-packages/pyacidobasic/phplot.py
debian/python-acidobasic/usr/lib/python2.7/site-packages/pyacidobasic/version.py
debian/python-acidobasic/usr/lib/python2.7/site-packages/pyacidobasic/version.pyc
debian/python-acidobasic/usr/lib/python2.7/site-packages/pyacidobasic/__init__.py
debian/python-acidobasic/usr/lib/python2.7/site-packages/pyacidobasic/prelevement.pyc
debian/python-acidobasic/usr/lib/python2.7/site-packages/pyacidobasic/curveControl.py
debian/python-acidobasic/usr/lib/python2.7/site-packages/pyacidobasic/Ui_curvecontrol.py
debian/python-acidobasic/usr/lib/python2.7/site-packages/pyacidobasic/acidebase.py
debian/python-acidobasic/usr/lib/python2.7/site-packages/pyacidobasic/reactifs.py
debian/python-acidobasic/usr/lib/python2.7/site-packages/pyacidobasic/Ui_curvecontrol.pyc
dh_builddeb: dpkg-deb --build debian/python-acidobasic .. returned exit code 1
make: *** [binary] Error 25
dpkg-buildpackage: error: /usr/bin/fakeroot debian/rules binary gave error exit status 2
******************************************************************************
Build finished at 20110826-1826
FAILED [dpkg-buildpackage died]
Purging chroot-autobuild/build/buildd/pyacidobasic-1.0

Tags: ftbfs oneiric
Matthias Klose (doko)
Changed in pyacidobasic (Ubuntu):
status: New → Confirmed
importance: Undecided → High
tags: removed: arm-porting-queue
Revision history for this message
Barry Warsaw (barry) wrote :

This is another one that builds fine for me locally, so the first step is to retry the build, which I'll do now.

Revision history for this message
Barry Warsaw (barry) wrote :

Wait, does this one only ftbfs in doko's test archive? I think it's fine in the main archive: https://launchpad.net/ubuntu/+source/pyacidobasic/1.0-3

Changed in pyacidobasic (Ubuntu Oneiric):
status: Confirmed → Incomplete
Matthias Klose (doko)
Changed in pyacidobasic (Ubuntu Oneiric):
status: Incomplete → Confirmed
Revision history for this message
Launchpad Janitor (janitor) wrote :

This bug was fixed in the package pyacidobasic - 1.0-3ubuntu1

---------------
pyacidobasic (1.0-3ubuntu1) oneiric; urgency=low

  * Fix build failure, don't use --prefix=/usr. LP: #835001.
  * Really use dh_python2.
 -- Matthias Klose <email address hidden> Mon, 12 Sep 2011 20:52:19 +0200

Changed in pyacidobasic (Ubuntu Oneiric):
status: Confirmed → Fix Released
To post a comment you must log in.
This report contains Public information  
Everyone can see this information.

Other bug subscribers