projectm version 2.0.1+dfsg-12 failed to build on armel & armhf: requires porting to GLES

Bug #791304 reported by Ricardo Salveti on 2011-06-01
8
This bug affects 1 person
Affects Status Importance Assigned to Milestone
projectm (Ubuntu)
Wishlist
Tom Gall

Bug Description

projectm version 2.0.1+dfsg-8 failed to build on armel
Link to failed build: https://launchpad.net/ubuntu/+source/projectm/2.0.1+dfsg-8/+build/2488383

Direct link to the build log: https://launchpad.net/ubuntu/+source/projectm/2.0.1+dfsg-8/+build/2488383/+files/buildlog_ubuntu-oneiric-armel.projectm_2.0.1%2Bdfsg-8_FAILEDTOBUILD.txt.gz

This log snippet might be of interest, since it triggered the matcher 'Purging chroot-autobuild'.
Excerpt 1522 lines into the build log:

/build/buildd/projectm-2.0.1+dfsg/src/projectM-qt/qprojectmwidget.hpp:288:19: error: 'GL_MODELVIEW' was not declared in this scope
/build/buildd/projectm-2.0.1+dfsg/src/projectM-qt/qprojectmwidget.hpp:291:27: error: 'glDrawBuffer' was not declared in this scope
/build/buildd/projectm-2.0.1+dfsg/src/projectM-qt/qprojectmwidget.hpp:292:27: error: 'glReadBuffer' was not declared in this scope
/build/buildd/projectm-2.0.1+dfsg/src/projectM-qt/qprojectmwidget.hpp:297:15: error: 'GL_LINE_SMOOTH' was not declared in this scope
/build/buildd/projectm-2.0.1+dfsg/src/projectM-qt/qprojectmwidget.hpp:298:15: error: 'GL_POINT_SMOOTH' was not declared in this scope
/build/buildd/projectm-2.0.1+dfsg/src/projectM-qt/qprojectmwidget.hpp:304:30: error: 'glLineStipple' was not declared in this scope
make[3]: *** [projectM-qt/CMakeFiles/projectM-qt.dir/qprojectm_mainwindow.o] Error 1
make[3]: Leaving directory `/build/buildd/projectm-2.0.1+dfsg/src/build'
make[2]: *** [projectM-qt/CMakeFiles/projectM-qt.dir/all] Error 2
make[2]: Leaving directory `/build/buildd/projectm-2.0.1+dfsg/src/build'
make[1]: *** [all] Error 2
make[1]: Leaving directory `/build/buildd/projectm-2.0.1+dfsg/src/build'
dh_auto_build: make -j1 returned exit code 2
make: *** [build] Error 2
dpkg-buildpackage: error: debian/rules build gave error exit status 2
******************************************************************************
Build finished at 20110512-1146
FAILED [dpkg-buildpackage died]
Purging chroot-autobuild/build/buildd/projectm-2.0.1+dfsg

Marcin Juszkiewicz (hrw) on 2011-06-15
tags: added: opengles
Tom Gall (tom-gall) on 2011-06-15
Changed in projectm (Ubuntu):
assignee: nobody → Tom Gall (tom-gall)
Jani Monoses (jani) on 2011-06-15
summary: - projectm version 2.0.1+dfsg-8 failed to build on armel
+ projectm version 2.0.1+dfsg-9 failed to build on armel
Daniel T Chen (crimsun) on 2012-01-22
summary: - projectm version 2.0.1+dfsg-9 failed to build on armel
+ projectm version 2.0.1+dfsg-12 failed to build on armel & armhf

It would be great if someone with ARM OpenGL experience could look at this...

Colin Watson (cjwatson) on 2012-04-19
summary: - projectm version 2.0.1+dfsg-12 failed to build on armel & armhf
+ projectm version 2.0.1+dfsg-12 failed to build on armel & armhf:
+ requires porting to GLES
Matthias Klumpp (ximion) on 2012-06-11
Changed in projectm (Ubuntu):
importance: Undecided → Wishlist
To post a comment you must log in.
This report contains Public information  Edit
Everyone can see this information.

Other bug subscribers