package procps 1:3.2.8-11ubuntu6 failed to install/upgrade: subprocess new pre-removal script returned error exit status 100

Bug #1338718 reported by vj sr on 2014-07-07
8
This bug affects 1 person
Affects Status Importance Assigned to Milestone
procps (Ubuntu)
Undecided
Unassigned

Bug Description

installArchives() failed: perl: warning: Setting locale failed.
perl: warning: Please check that your locale settings:
 LANGUAGE = (unset),
 LC_ALL = (unset),
 LANG = "en_IN.ISO8859-1"
    are supported and installed on your system.
perl: warning: Falling back to the standard locale ("C").
locale: Cannot set LC_CTYPE to default locale: No such file or directory
locale: Cannot set LC_MESSAGES to default locale: No such file or directory
locale: Cannot set LC_ALL to default locale: No such file or directory

Extracting templates from packages: 10%%
Extracting templates from packages: 20%%
Extracting templates from packages: 30%%
Extracting templates from packages: 40%%
Extracting templates from packages: 50%%
Extracting templates from packages: 60%%
Extracting templates from packages: 70%%
Extracting templates from packages: 80%%
Extracting templates from packages: 90%%
Extracting templates from packages: 100%%
Preconfiguring packages ...
perl: warning: Setting locale failed.
perl: warning: Please check that your locale settings:
 LANGUAGE = (unset),
 LC_ALL = (unset),
 LANG = "en_IN.ISO8859-1"
    are supported and installed on your system.
perl: warning: Falling back to the standard locale ("C").
locale: Cannot set LC_CTYPE to default locale: No such file or directory
locale: Cannot set LC_MESSAGES to default locale: No such file or directory
locale: Cannot set LC_ALL to default locale: No such file or directory

Extracting templates from packages: 10%%
Extracting templates from packages: 20%%
Extracting templates from packages: 30%%
Extracting templates from packages: 40%%
Extracting templates from packages: 50%%
Extracting templates from packages: 60%%
Extracting templates from packages: 70%%
Extracting templates from packages: 80%%
Extracting templates from packages: 90%%
Extracting templates from packages: 100%%
Preconfiguring packages ...
perl: warning: Setting locale failed.
perl: warning: Please check that your locale settings:
 LANGUAGE = (unset),
 LC_ALL = (unset),
 LANG = "en_IN.ISO8859-1"
    are supported and installed on your system.
perl: warning: Falling back to the standard locale ("C").
locale: Cannot set LC_CTYPE to default locale: No such file or directory
locale: Cannot set LC_MESSAGES to default locale: No such file or directory
locale: Cannot set LC_ALL to default locale: No such file or directory

Extracting templates from packages: 10%%
Extracting templates from packages: 20%%
Extracting templates from packages: 30%%
Extracting templates from packages: 40%%
Extracting templates from packages: 50%%
Extracting templates from packages: 60%%
Extracting templates from packages: 70%%
Extracting templates from packages: 80%%
Extracting templates from packages: 90%%
Extracting templates from packages: 100%%
Preconfiguring packages ...
perl: warning: Setting locale failed.
perl: warning: Please check that your locale settings:
 LANGUAGE = (unset),
 LC_ALL = (unset),
 LANG = "en_IN.ISO8859-1"
    are supported and installed on your system.
perl: warning: Falling back to the standard locale ("C").
locale: Cannot set LC_CTYPE to default locale: No such file or directory
locale: Cannot set LC_MESSAGES to default locale: No such file or directory
locale: Cannot set LC_ALL to default locale: No such file or directory

Extracting templates from packages: 10%%
Extracting templates from packages: 20%%
Extracting templates from packages: 30%%
Extracting templates from packages: 40%%
Extracting templates from packages: 50%%
Extracting templates from packages: 60%%
Extracting templates from packages: 70%%
Extracting templates from packages: 80%%
Extracting templates from packages: 90%%
Extracting templates from packages: 100%%
Preconfiguring packages ...
(Reading database ...
(Reading database ... 5%%
(Reading database ... 10%%
(Reading database ... 15%%
(Reading database ... 20%%
(Reading database ... 25%%
(Reading database ... 30%%
(Reading database ... 35%%
(Reading database ... 40%%
(Reading database ... 45%%
(Reading database ... 50%%
(Reading database ... 55%%
(Reading database ... 60%%
(Reading database ... 65%%
(Reading database ... 70%%
(Reading database ... 75%%
(Reading database ... 80%%
(Reading database ... 85%%
(Reading database ... 90%%
(Reading database ... 95%%
(Reading database ... 100%%
(Reading database ... 489626 files and directories currently installed.)
Preparing to replace procps 1:3.2.8-11ubuntu6 (using .../procps_1%%3a3.2.8-11ubuntu6.3_amd64.deb) ...
invoke-rc.d: unknown initscript, /etc/init.d/procps not found.
dpkg: warning: subprocess old pre-removal script returned error exit status 100
dpkg - trying script from the new package instead ...
invoke-rc.d: unknown initscript, /etc/init.d/procps not found.
dpkg: error processing /var/cache/apt/archives/procps_1%%3a3.2.8-11ubuntu6.3_amd64.deb (--unpack):
 subprocess new pre-removal script returned error exit status 100
invoke-rc.d: unknown initscript, /etc/init.d/procps not found.
dpkg: error while cleaning up:
 subprocess installed post-installation script returned error exit status 100
Preparing to replace bluez 4.98-2ubuntu7 (using .../bluez_4.98-2ubuntu7.2_amd64.deb) ...
invoke-rc.d: unknown initscript, /etc/init.d/bluetooth not found.
dpkg: warning: subprocess old pre-removal script returned error exit status 100
dpkg - trying script from the new package instead ...
invoke-rc.d: unknown initscript, /etc/init.d/bluetooth not found.
dpkg: error processing /var/cache/apt/archives/bluez_4.98-2ubuntu7.2_amd64.deb (--unpack):
 subprocess new pre-removal script returned error exit status 100
invoke-rc.d: unknown initscript, /etc/init.d/bluetooth not found.
dpkg: error while cleaning up:
 subprocess installed post-installation script returned error exit status 100
Preparing to replace libldap-2.4-2 2.4.28-1.1ubuntu4.3 (using .../libldap-2.4-2_2.4.28-1.1ubuntu4.4_amd64.deb) ...
De-configuring libldap-2.4-2:i386 ...
Unpacking replacement libldap-2.4-2 ...
Preparing to replace libldap-2.4-2:i386 2.4.28-1.1ubuntu4.3 (using .../libldap-2.4-2_2.4.28-1.1ubuntu4.4_i386.deb) ...
Unpacking replacement libldap-2.4-2:i386 ...
Processing triggers for man-db ...
locale: Cannot set LC_CTYPE to default locale: No such file or directory
locale: Cannot set LC_MESSAGES to default locale: No such file or directory
locale: Cannot set LC_ALL to default locale: No such file or directory
Errors were encountered while processing:
 /var/cache/apt/archives/procps_1%%3a3.2.8-11ubuntu6.3_amd64.deb
 /var/cache/apt/archives/bluez_4.98-2ubuntu7.2_amd64.deb
Error in function:
SystemError: E:Sub-process /usr/bin/dpkg returned an error code (1)
dpkg: error processing procps (--configure):
 Package is in a very bad inconsistent state - you should
 reinstall it before attempting configuration.
Setting up vsftpd (2.3.5-1ubuntu2) ...
locale: Cannot set LC_CTYPE to default locale: No such file or directory
locale: Cannot set LC_MESSAGES to default locale: No such file or directory
locale: Cannot set LC_ALL to default locale: No such file or directory
vsftpd user (ftp) already exists, doing nothing.

vsftpd directory (/srv/ftp) already exists, doing nothing.
invoke-rc.d: unknown initscript, /etc/init.d/vsftpd not found.
dpkg: error processing vsftpd (--configure):
 subprocess installed post-installation script returned error exit status 100
Setting up libldap-2.4-2 (2.4.28-1.1ubuntu4.4) ...
Setting up libldap-2.4-2:i386 (2.4.28-1.1ubuntu4.4) ...
dpkg: dependency problems prevent configuration of udev:
 udev depends on procps; however:
  Package procps is not configured yet.
dpkg: error processing udev (--configure):
 dependency problems - leaving unconfigured
dpkg: dependency problems prevent configuration of initramfs-tools:
 initramfs-tools depends on udev (>= 147~-5); however:
  Package udev is not configured yet.
dpkg: error processing initramfs-tools (--configure):
 dependency problems - leaving unconfigured
dpkg: dependency problems prevent configuration of bluez:
 bluez depends on udev (>= 170-1); however:
  Package udev is not configured yet.
dpkg: error processing bluez (--configure):
 dependency problems - leaving unconfigured
dpkg: dependency problems prevent configuration of dmsetup:
 dmsetup depends on initramfs-tools; however:
  Package initramfs-tools is not configured yet.
 dmsetup depends on udev (>> 141-2); however:
  Package udev is not configured yet.
dpkg: error processing dmsetup (--configure):
 dependency problems - leaving unconfigured
dpkg: dependency problems prevent configuration of libdevmapper1.02.1:
 libdevmapper1.02.1 depends on dmsetup (>= 2:1.02.48-4ubuntu7.4); however:
  Package dmsetup is not configured yet.
dpkg: error processing libdevmapper1.02.1 (--configure):
 dependency problems - leaving unconfigured
Processing triggers for libc-bin ...
ldconfig deferred processing now taking place

ProblemType: Package
DistroRelease: Ubuntu 12.04
Package: procps 1:3.2.8-11ubuntu6
ProcVersionSignature: Ubuntu 3.2.0-53.81-generic 3.2.50
Uname: Linux 3.2.0-53-generic x86_64
ApportVersion: 2.0.1-0ubuntu17.4
Architecture: amd64
Date: Mon Jul 7 23:58:32 2014
DuplicateSignature: package:procps:1:3.2.8-11ubuntu6:subprocess new pre-removal script returned error exit status 100
ErrorMessage: subprocess new pre-removal script returned error exit status 100
InstallationMedia: Ubuntu 12.04 LTS "Precise Pangolin" - Release amd64 (20120425)
MarkForUpload: True
SourcePackage: procps
Title: package procps 1:3.2.8-11ubuntu6 failed to install/upgrade: subprocess new pre-removal script returned error exit status 100
UpgradeStatus: No upgrade log present (probably fresh install)

vj sr (rushtovijay-yahoo) wrote :
tags: removed: need-duplicate-check
To post a comment you must log in.
This report contains Public information  Edit
Everyone can see this information.

Other bug subscribers