autopkgtest fails in hirsute

Bug #1920819 reported by Balint Reczey
This bug affects 1 person
Affects Status Importance Assigned to Milestone
pollen (Ubuntu)

Bug Description
 make -j1 test
make[1]: Entering directory '/tmp/autopkgtest.Jxqs4u/autopkgtest_tmp'
go test
go: go.mod file not found in current directory or any parent directory; see 'go help modules'
make[1]: *** [Makefile:11: test] Error 1
dh_auto_test: error: make -j1 test returned exit code 2
make[1]: Leaving directory '/tmp/autopkgtest.Jxqs4u/autopkgtest_tmp'
make: *** [debian/rules:6: build] Error 25
autopkgtest [17:19:49]: test dh-golang-autopkgtest: -----------------------]
dh-golang-autopkgtest FAIL non-zero exit status 2

Related branches

To post a comment you must log in.
This report contains Public information  
Everyone can see this information.

Other bug subscribers

Remote bug watches

Bug watches keep track of this bug in other bug trackers.